{"text_format":"1","workbook":"xlsx","n_sheets":4,"sheets":["SUMMARY","1","Lots","Macros"],"not_rendered":{"charts":0,"images":0,"macros":1,"external_links":0,"defined_names":14,"comments":0,"pivot_tables":0},"unopened":[{"sheet":"Macros","index":3,"reason":"part_missing"}],"bounds":{"document_bytes":16777216,"sheet_cells":100000,"rows_first":2000,"rows_last":500,"rows_between":2000,"halvings":0,"cell_chars":16384,"cell_head_chars":4096},"cells_cut":0,"cells_raw":0,"read":"whole","date_system":"1900"}

{"sheet":"SUMMARY","index":0,"n_rows":312,"n_cols":23,"rows_kept":312,"cut":false,"hidden":false,"merged":[[0,12,10,12],[0,22,10,22],[9,16,9,21],[10,16,10,17],[10,18,10,19],[10,20,10,21]]}
["P401  ASPHALTIC CONCRETE  -  PAYMENT ADJUSTMENTS FOR DENSITIES & AIR VOIDS (ver 4/15/20)",null,null,null,null,null,null,null,null,null,null,null," Density D = Two Sided  S = Single Sided",null,null,null,null,1,null,null,null,null,"Density Criteria S=Surface, B= Base Course"]
[null,null,null,null,null,null,null,null,null,null,null,null,null,null,null,null,null,0]
[{"$f":"'1'!A3","v":"AIRPORT NAME"}]
[{"$f":"'1'!A4","v":"PROJECT DESCRIPTION"}]
[{"$f":"'1'!A5","v":"PROJECT NUMBER"}]
[{"$f":"'1'!U72","v":"P-401 SUMMARY (Single-Sided Density IAW 5370-10G)"}]
["Maximum Project Pay (percent)",null,"Maximum Total Payment","Penalties due to Rejected Lots","Project Cap  in Dollars",null,null,null,null,"Total Payment Allowed for Project            (see note below)"]
[100,null,{"$f":"IF(ISBLANK(A8),\"ENTER\",N12+O12)","v":0},{"$f":"IF(ISBLANK(A8),\"PROJECT\",P12)","v":0},{"$f":"IF(ISBLANK(A8),\"PERCENT CAP (cell A8)\",C8-D8)","v":0},null,null,null,null,null,{"$f":"IF(SUM(L13:L312)<=E8,SUM(L13:L312),E8)","v":0},null,null,null,null,null,{"$f":"MAX(Lots!A:A)","v":0},"Highest lot # recorded"]
[null,null,null,null,null,null,null,null,null,null,null,null,null,"$ pay"]
[null,"LOT QUANTITIES (ton)",null,"UNIT PRICE/ton",null,"PAY FACTOR",null,null,null,"$ PAY PER LOT",null,null,null,"Mixture","AC","penaltie ","SUMMARY OF LOT PROPERTIES (averages)"]
["LOT","MIX","AC","MIX","AC","Density","Air Void","Joint","Final","MIX","AC","TOTAL",null,"MAX possible","MAX possible","due to 50%","   Mat       Density   PWL",null,"   Joint      Density   PWL",null,"  Air Voids     Avg     PWL"]
["TOTALS",null,null,"$","$","%","%","Deduct ","%",null,null,null,null,{"$f":"SUM(N13:N312)","v":0},{"$f":"SUM(O13:O312)","v":0},{"$f":"SUM(P13:P312)","v":0}]
[{"$f":"IF(Lots!A2=\"\",\"\",Lots!A2)","v":""},{"$f":"IF(Lots!A2=\"\",\"\",Lots!F2)","v":""},{"$f":"IF(Lots!A2=\"\",\"\",Lots!J2)","v":""},{"$f":"IF(Lots!A2=\"\",\"\",Lots!G2)","v":""},{"$f":"IF(Lots!A2=\"\",\"\",Lots!H2)","v":""},{"$f":"IF(Lots!A2=\"\",\"\",Lots!EA2)","v":""},{"$f":"IF(Lots!A2=\"\",\"\",Lots!EB2)","v":""},{"$f":"IF(Lots!A2=\"\",\"\",Lots!EK2)","v":""},{"$f":"IF(Lots!A2=\"\",\"\",Lots!EF2)","v":""},{"$f":"IF(Lots!F2=\"\",\"\",Lots!EG2)","v":""},{"$f":"IF(Lots!H2=\"\",\"\",Lots!EH2)","v":""},{"$f":"IF(A13=\"\",\"\",SUM(J13:K13))","v":""},{"$f":"IF(A13=\"\",\"\",IF(Lots!ET2=TRUE,\"D\",\"S\"))","v":""},{"$f":"IF(A13=\"\",0,$A$8/100*D13*B13)","v":0},{"$f":"IF(A13=\"\",0,$A$8/100*E13*C13)","v":0},{"$f":"IF(I13>50,0,L13)","v":0},{"$f":"IF(Lots!A2=\"\",\"\",Lots!EM2)","v":""},{"$f":"IF(Lots!A2=\"\",\"\",Lots!EN2)","v":""},{"$f":"IF(Lots!A2=\"\",\"\",Lots!EO2)","v":""},{"$f":"IF(Lots!A2=\"\",\"\",Lots!EP2)","v":""},{"$f":"IF(Lots!A2=\"\",\"\",Lots!EQ2)","v":""},{"$f":"IF(Lots!A2=\"\",\"\",Lots!ER2)","v":""},{"$f":"IF(Lots!A2=\"\",\"\",IF(Lots!ES2=TRUE,\"B\",\"S\"))","v":""}]
[{"$f":"IF(Lots!A3=\"\",\"\",Lots!A3)","v":""},{"$f":"IF(Lots!A3=\"\",\"\",Lots!F3)","v":""},{"$f":"IF(Lots!A3=\"\",\"\",Lots!J3)","v":""},{"$f":"IF(Lots!A3=\"\",\"\",Lots!G3)","v":""},{"$f":"IF(Lots!A3=\"\",\"\",Lots!H3)","v":""},{"$f":"IF(Lots!A3=\"\",\"\",Lots!EA3)","v":""},{"$f":"IF(Lots!A3=\"\",\"\",Lots!EB3)","v":""},{"$f":"IF(Lots!A3=\"\",\"\",Lots!EK3)","v":""},{"$f":"IF(Lots!A3=\"\",\"\",Lots!EF3)","v":""},{"$f":"IF(Lots!F3=\"\",\"\",Lots!EG3)","v":""},{"$f":"IF(Lots!H3=\"\",\"\",Lots!EH3)","v":""},{"$f":"IF(A14=\"\",\"\",SUM(J14:K14))","v":""},{"$f":"IF(A14=\"\",\"\",IF(Lots!ET3=TRUE,\"D\",\"S\"))","v":""},0,0,0,{"$f":"IF(Lots!A3=\"\",\"\",Lots!EM3)","v":""},{"$f":"IF(Lots!A3=\"\",\"\",Lots!EN3)","v":""},{"$f":"IF(Lots!A3=\"\",\"\",Lots!EO3)","v":""},{"$f":"IF(Lots!A3=\"\",\"\",Lots!EP3)","v":""},{"$f":"IF(Lots!A3=\"\",\"\",Lots!EQ3)","v":""},{"$f":"IF(Lots!A3=\"\",\"\",Lots!ER3)","v":""},{"$f":"IF(Lots!A3=\"\",\"\",IF(Lots!ES3=TRUE,\"B\",\"S\"))","v":""}]
[{"$f":"IF(Lots!A4=\"\",\"\",Lots!A4)","v":""},{"$f":"IF(Lots!A4=\"\",\"\",Lots!F4)","v":""},{"$f":"IF(Lots!A4=\"\",\"\",Lots!J4)","v":""},{"$f":"IF(Lots!A4=\"\",\"\",Lots!G4)","v":""},{"$f":"IF(Lots!A4=\"\",\"\",Lots!H4)","v":""},{"$f":"IF(Lots!A4=\"\",\"\",Lots!EA4)","v":""},{"$f":"IF(Lots!A4=\"\",\"\",Lots!EB4)","v":""},{"$f":"IF(Lots!A4=\"\",\"\",Lots!EK4)","v":""},{"$f":"IF(Lots!A4=\"\",\"\",Lots!EF4)","v":""},{"$f":"IF(Lots!F4=\"\",\"\",Lots!EG4)","v":""},{"$f":"IF(Lots!H4=\"\",\"\",Lots!EH4)","v":""},"",{"$f":"IF(A15=\"\",\"\",IF(Lots!ET4=TRUE,\"D\",\"S\"))","v":""},0,0,0,{"$f":"IF(Lots!A4=\"\",\"\",Lots!EM4)","v":""},{"$f":"IF(Lots!A4=\"\",\"\",Lots!EN4)","v":""},{"$f":"IF(Lots!A4=\"\",\"\",Lots!EO4)","v":""},{"$f":"IF(Lots!A4=\"\",\"\",Lots!EP4)","v":""},{"$f":"IF(Lots!A4=\"\",\"\",Lots!EQ4)","v":""},{"$f":"IF(Lots!A4=\"\",\"\",Lots!ER4)","v":""},{"$f":"IF(Lots!A4=\"\",\"\",IF(Lots!ES4=TRUE,\"B\",\"S\"))","v":""}]
[{"$f":"IF(Lots!A5=\"\",\"\",Lots!A5)","v":""},{"$f":"IF(Lots!A5=\"\",\"\",Lots!F5)","v":""},{"$f":"IF(Lots!A5=\"\",\"\",Lots!J5)","v":""},{"$f":"IF(Lots!A5=\"\",\"\",Lots!G5)","v":""},{"$f":"IF(Lots!A5=\"\",\"\",Lots!H5)","v":""},{"$f":"IF(Lots!A5=\"\",\"\",Lots!EA5)","v":""},{"$f":"IF(Lots!A5=\"\",\"\",Lots!EB5)","v":""},{"$f":"IF(Lots!A5=\"\",\"\",Lots!EK5)","v":""},{"$f":"IF(Lots!A5=\"\",\"\",Lots!EF5)","v":""},{"$f":"IF(Lots!F5=\"\",\"\",Lots!EG5)","v":""},{"$f":"IF(Lots!H5=\"\",\"\",Lots!EH5)","v":""},"",{"$f":"IF(A16=\"\",\"\",IF(Lots!ET5=TRUE,\"D\",\"S\"))","v":""},0,0,0,{"$f":"IF(Lots!A5=\"\",\"\",Lots!EM5)","v":""},{"$f":"IF(Lots!A5=\"\",\"\",Lots!EN5)","v":""},{"$f":"IF(Lots!A5=\"\",\"\",Lots!EO5)","v":""},{"$f":"IF(Lots!A5=\"\",\"\",Lots!EP5)","v":""},{"$f":"IF(Lots!A5=\"\",\"\",Lots!EQ5)","v":""},{"$f":"IF(Lots!A5=\"\",\"\",Lots!ER5)","v":""},{"$f":"IF(Lots!A5=\"\",\"\",IF(Lots!ES5=TRUE,\"B\",\"S\"))","v":""}]
[{"$f":"IF(Lots!A6=\"\",\"\",Lots!A6)","v":""},{"$f":"IF(Lots!A6=\"\",\"\",Lots!F6)","v":""},{"$f":"IF(Lots!A6=\"\",\"\",Lots!J6)","v":""},{"$f":"IF(Lots!A6=\"\",\"\",Lots!G6)","v":""},{"$f":"IF(Lots!A6=\"\",\"\",Lots!H6)","v":""},{"$f":"IF(Lots!A6=\"\",\"\",Lots!EA6)","v":""},{"$f":"IF(Lots!A6=\"\",\"\",Lots!EB6)","v":""},{"$f":"IF(Lots!A6=\"\",\"\",Lots!EK6)","v":""},{"$f":"IF(Lots!A6=\"\",\"\",Lots!EF6)","v":""},{"$f":"IF(Lots!F6=\"\",\"\",Lots!EG6)","v":""},{"$f":"IF(Lots!H6=\"\",\"\",Lots!EH6)","v":""},"",{"$f":"IF(A17=\"\",\"\",IF(Lots!ET6=TRUE,\"D\",\"S\"))","v":""},0,0,0,{"$f":"IF(Lots!A6=\"\",\"\",Lots!EM6)","v":""},{"$f":"IF(Lots!A6=\"\",\"\",Lots!EN6)","v":""},{"$f":"IF(Lots!A6=\"\",\"\",Lots!EO6)","v":""},{"$f":"IF(Lots!A6=\"\",\"\",Lots!EP6)","v":""},{"$f":"IF(Lots!A6=\"\",\"\",Lots!EQ6)","v":""},{"$f":"IF(Lots!A6=\"\",\"\",Lots!ER6)","v":""},{"$f":"IF(Lots!A6=\"\",\"\",IF(Lots!ES6=TRUE,\"B\",\"S\"))","v":""}]
[{"$f":"IF(Lots!A7=\"\",\"\",Lots!A7)","v":""},{"$f":"IF(Lots!A7=\"\",\"\",Lots!F7)","v":""},{"$f":"IF(Lots!A7=\"\",\"\",Lots!J7)","v":""},{"$f":"IF(Lots!A7=\"\",\"\",Lots!G7)","v":""},{"$f":"IF(Lots!A7=\"\",\"\",Lots!H7)","v":""},{"$f":"IF(Lots!A7=\"\",\"\",Lots!EA7)","v":""},{"$f":"IF(Lots!A7=\"\",\"\",Lots!EB7)","v":""},{"$f":"IF(Lots!A7=\"\",\"\",Lots!EK7)","v":""},{"$f":"IF(Lots!A7=\"\",\"\",Lots!EF7)","v":""},{"$f":"IF(Lots!F7=\"\",\"\",Lots!EG7)","v":""},{"$f":"IF(Lots!H7=\"\",\"\",Lots!EH7)","v":""},"",{"$f":"IF(A18=\"\",\"\",IF(Lots!ET7=TRUE,\"D\",\"S\"))","v":""},0,0,0,{"$f":"IF(Lots!A7=\"\",\"\",Lots!EM7)","v":""},{"$f":"IF(Lots!A7=\"\",\"\",Lots!EN7)","v":""},{"$f":"IF(Lots!A7=\"\",\"\",Lots!EO7)","v":""},{"$f":"IF(Lots!A7=\"\",\"\",Lots!EP7)","v":""},{"$f":"IF(Lots!A7=\"\",\"\",Lots!EQ7)","v":""},{"$f":"IF(Lots!A7=\"\",\"\",Lots!ER7)","v":""},{"$f":"IF(Lots!A7=\"\",\"\",IF(Lots!ES7=TRUE,\"B\",\"S\"))","v":""}]
[{"$f":"IF(Lots!A8=\"\",\"\",Lots!A8)","v":""},{"$f":"IF(Lots!A8=\"\",\"\",Lots!F8)","v":""},{"$f":"IF(Lots!A8=\"\",\"\",Lots!J8)","v":""},{"$f":"IF(Lots!A8=\"\",\"\",Lots!G8)","v":""},{"$f":"IF(Lots!A8=\"\",\"\",Lots!H8)","v":""},{"$f":"IF(Lots!A8=\"\",\"\",Lots!EA8)","v":""},{"$f":"IF(Lots!A8=\"\",\"\",Lots!EB8)","v":""},{"$f":"IF(Lots!A8=\"\",\"\",Lots!EK8)","v":""},{"$f":"IF(Lots!A8=\"\",\"\",Lots!EF8)","v":""},{"$f":"IF(Lots!F8=\"\",\"\",Lots!EG8)","v":""},{"$f":"IF(Lots!H8=\"\",\"\",Lots!EH8)","v":""},"",{"$f":"IF(A19=\"\",\"\",IF(Lots!ET8=TRUE,\"D\",\"S\"))","v":""},0,0,0,{"$f":"IF(Lots!A8=\"\",\"\",Lots!EM8)","v":""},{"$f":"IF(Lots!A8=\"\",\"\",Lots!EN8)","v":""},{"$f":"IF(Lots!A8=\"\",\"\",Lots!EO8)","v":""},{"$f":"IF(Lots!A8=\"\",\"\",Lots!EP8)","v":""},{"$f":"IF(Lots!A8=\"\",\"\",Lots!EQ8)","v":""},{"$f":"IF(Lots!A8=\"\",\"\",Lots!ER8)","v":""},{"$f":"IF(Lots!A8=\"\",\"\",IF(Lots!ES8=TRUE,\"B\",\"S\"))","v":""}]
[{"$f":"IF(Lots!A9=\"\",\"\",Lots!A9)","v":""},{"$f":"IF(Lots!A9=\"\",\"\",Lots!F9)","v":""},{"$f":"IF(Lots!A9=\"\",\"\",Lots!J9)","v":""},{"$f":"IF(Lots!A9=\"\",\"\",Lots!G9)","v":""},{"$f":"IF(Lots!A9=\"\",\"\",Lots!H9)","v":""},{"$f":"IF(Lots!A9=\"\",\"\",Lots!EA9)","v":""},{"$f":"IF(Lots!A9=\"\",\"\",Lots!EB9)","v":""},{"$f":"IF(Lots!A9=\"\",\"\",Lots!EK9)","v":""},{"$f":"IF(Lots!A9=\"\",\"\",Lots!EF9)","v":""},{"$f":"IF(Lots!F9=\"\",\"\",Lots!EG9)","v":""},{"$f":"IF(Lots!H9=\"\",\"\",Lots!EH9)","v":""},"",{"$f":"IF(A20=\"\",\"\",IF(Lots!ET9=TRUE,\"D\",\"S\"))","v":""},0,0,0,{"$f":"IF(Lots!A9=\"\",\"\",Lots!EM9)","v":""},{"$f":"IF(Lots!A9=\"\",\"\",Lots!EN9)","v":""},{"$f":"IF(Lots!A9=\"\",\"\",Lots!EO9)","v":""},{"$f":"IF(Lots!A9=\"\",\"\",Lots!EP9)","v":""},{"$f":"IF(Lots!A9=\"\",\"\",Lots!EQ9)","v":""},{"$f":"IF(Lots!A9=\"\",\"\",Lots!ER9)","v":""},{"$f":"IF(Lots!A9=\"\",\"\",IF(Lots!ES9=TRUE,\"B\",\"S\"))","v":""}]
[{"$f":"IF(Lots!A10=\"\",\"\",Lots!A10)","v":""},{"$f":"IF(Lots!A10=\"\",\"\",Lots!F10)","v":""},{"$f":"IF(Lots!A10=\"\",\"\",Lots!J10)","v":""},{"$f":"IF(Lots!A10=\"\",\"\",Lots!G10)","v":""},{"$f":"IF(Lots!A10=\"\",\"\",Lots!H10)","v":""},{"$f":"IF(Lots!A10=\"\",\"\",Lots!EA10)","v":""},{"$f":"IF(Lots!A10=\"\",\"\",Lots!EB10)","v":""},{"$f":"IF(Lots!A10=\"\",\"\",Lots!EK10)","v":""},{"$f":"IF(Lots!A10=\"\",\"\",Lots!EF10)","v":""},{"$f":"IF(Lots!F10=\"\",\"\",Lots!EG10)","v":""},{"$f":"IF(Lots!H10=\"\",\"\",Lots!EH10)","v":""},"",{"$f":"IF(A21=\"\",\"\",IF(Lots!ET10=TRUE,\"D\",\"S\"))","v":""},0,0,0,{"$f":"IF(Lots!A10=\"\",\"\",Lots!EM10)","v":""},{"$f":"IF(Lots!A10=\"\",\"\",Lots!EN10)","v":""},{"$f":"IF(Lots!A10=\"\",\"\",Lots!EO10)","v":""},{"$f":"IF(Lots!A10=\"\",\"\",Lots!EP10)","v":""},{"$f":"IF(Lots!A10=\"\",\"\",Lots!EQ10)","v":""},{"$f":"IF(Lots!A10=\"\",\"\",Lots!ER10)","v":""},{"$f":"IF(Lots!A10=\"\",\"\",IF(Lots!ES10=TRUE,\"B\",\"S\"))","v":""}]
[{"$f":"IF(Lots!A11=\"\",\"\",Lots!A11)","v":""},{"$f":"IF(Lots!A11=\"\",\"\",Lots!F11)","v":""},{"$f":"IF(Lots!A11=\"\",\"\",Lots!J11)","v":""},{"$f":"IF(Lots!A11=\"\",\"\",Lots!G11)","v":""},{"$f":"IF(Lots!A11=\"\",\"\",Lots!H11)","v":""},{"$f":"IF(Lots!A11=\"\",\"\",Lots!EA11)","v":""},{"$f":"IF(Lots!A11=\"\",\"\",Lots!EB11)","v":""},{"$f":"IF(Lots!A11=\"\",\"\",Lots!EK11)","v":""},{"$f":"IF(Lots!A11=\"\",\"\",Lots!EF11)","v":""},{"$f":"IF(Lots!F11=\"\",\"\",Lots!EG11)","v":""},{"$f":"IF(Lots!H11=\"\",\"\",Lots!EH11)","v":""},"",{"$f":"IF(A22=\"\",\"\",IF(Lots!ET11=TRUE,\"D\",\"S\"))","v":""},0,0,0,{"$f":"IF(Lots!A11=\"\",\"\",Lots!EM11)","v":""},{"$f":"IF(Lots!A11=\"\",\"\",Lots!EN11)","v":""},{"$f":"IF(Lots!A11=\"\",\"\",Lots!EO11)","v":""},{"$f":"IF(Lots!A11=\"\",\"\",Lots!EP11)","v":""},{"$f":"IF(Lots!A11=\"\",\"\",Lots!EQ11)","v":""},{"$f":"IF(Lots!A11=\"\",\"\",Lots!ER11)","v":""},{"$f":"IF(Lots!A11=\"\",\"\",IF(Lots!ES11=TRUE,\"B\",\"S\"))","v":""}]
[{"$f":"IF(Lots!A12=\"\",\"\",Lots!A12)","v":""},{"$f":"IF(Lots!A12=\"\",\"\",Lots!F12)","v":""},{"$f":"IF(Lots!A12=\"\",\"\",Lots!J12)","v":""},{"$f":"IF(Lots!A12=\"\",\"\",Lots!G12)","v":""},{"$f":"IF(Lots!A12=\"\",\"\",Lots!H12)","v":""},{"$f":"IF(Lots!A12=\"\",\"\",Lots!EA12)","v":""},{"$f":"IF(Lots!A12=\"\",\"\",Lots!EB12)","v":""},{"$f":"IF(Lots!A12=\"\",\"\",Lots!EK12)","v":""},{"$f":"IF(Lots!A12=\"\",\"\",Lots!EF12)","v":""},{"$f":"IF(Lots!F12=\"\",\"\",Lots!EG12)","v":""},{"$f":"IF(Lots!H12=\"\",\"\",Lots!EH12)","v":""},"",{"$f":"IF(A23=\"\",\"\",IF(Lots!ET12=TRUE,\"D\",\"S\"))","v":""},0,0,0,{"$f":"IF(Lots!A12=\"\",\"\",Lots!EM12)","v":""},{"$f":"IF(Lots!A12=\"\",\"\",Lots!EN12)","v":""},{"$f":"IF(Lots!A12=\"\",\"\",Lots!EO12)","v":""},{"$f":"IF(Lots!A12=\"\",\"\",Lots!EP12)","v":""},{"$f":"IF(Lots!A12=\"\",\"\",Lots!EQ12)","v":""},{"$f":"IF(Lots!A12=\"\",\"\",Lots!ER12)","v":""},{"$f":"IF(Lots!A12=\"\",\"\",IF(Lots!ES12=TRUE,\"B\",\"S\"))","v":""}]
[{"$f":"IF(Lots!A13=\"\",\"\",Lots!A13)","v":""},{"$f":"IF(Lots!A13=\"\",\"\",Lots!F13)","v":""},{"$f":"IF(Lots!A13=\"\",\"\",Lots!J13)","v":""},{"$f":"IF(Lots!A13=\"\",\"\",Lots!G13)","v":""},{"$f":"IF(Lots!A13=\"\",\"\",Lots!H13)","v":""},{"$f":"IF(Lots!A13=\"\",\"\",Lots!EA13)","v":""},{"$f":"IF(Lots!A13=\"\",\"\",Lots!EB13)","v":""},{"$f":"IF(Lots!A13=\"\",\"\",Lots!EK13)","v":""},{"$f":"IF(Lots!A13=\"\",\"\",Lots!EF13)","v":""},{"$f":"IF(Lots!F13=\"\",\"\",Lots!EG13)","v":""},{"$f":"IF(Lots!H13=\"\",\"\",Lots!EH13)","v":""},"",{"$f":"IF(A24=\"\",\"\",IF(Lots!ET13=TRUE,\"D\",\"S\"))","v":""},0,0,0,{"$f":"IF(Lots!A13=\"\",\"\",Lots!EM13)","v":""},{"$f":"IF(Lots!A13=\"\",\"\",Lots!EN13)","v":""},{"$f":"IF(Lots!A13=\"\",\"\",Lots!EO13)","v":""},{"$f":"IF(Lots!A13=\"\",\"\",Lots!EP13)","v":""},{"$f":"IF(Lots!A13=\"\",\"\",Lots!EQ13)","v":""},{"$f":"IF(Lots!A13=\"\",\"\",Lots!ER13)","v":""},{"$f":"IF(Lots!A13=\"\",\"\",IF(Lots!ES13=TRUE,\"B\",\"S\"))","v":""}]
[{"$f":"IF(Lots!A14=\"\",\"\",Lots!A14)","v":""},{"$f":"IF(Lots!A14=\"\",\"\",Lots!F14)","v":""},{"$f":"IF(Lots!A14=\"\",\"\",Lots!J14)","v":""},{"$f":"IF(Lots!A14=\"\",\"\",Lots!G14)","v":""},{"$f":"IF(Lots!A14=\"\",\"\",Lots!H14)","v":""},{"$f":"IF(Lots!A14=\"\",\"\",Lots!EA14)","v":""},{"$f":"IF(Lots!A14=\"\",\"\",Lots!EB14)","v":""},{"$f":"IF(Lots!A14=\"\",\"\",Lots!EK14)","v":""},{"$f":"IF(Lots!A14=\"\",\"\",Lots!EF14)","v":""},{"$f":"IF(Lots!F14=\"\",\"\",Lots!EG14)","v":""},{"$f":"IF(Lots!H14=\"\",\"\",Lots!EH14)","v":""},"",{"$f":"IF(A25=\"\",\"\",IF(Lots!ET14=TRUE,\"D\",\"S\"))","v":""},0,0,0,{"$f":"IF(Lots!A14=\"\",\"\",Lots!EM14)","v":""},{"$f":"IF(Lots!A14=\"\",\"\",Lots!EN14)","v":""},{"$f":"IF(Lots!A14=\"\",\"\",Lots!EO14)","v":""},{"$f":"IF(Lots!A14=\"\",\"\",Lots!EP14)","v":""},{"$f":"IF(Lots!A14=\"\",\"\",Lots!EQ14)","v":""},{"$f":"IF(Lots!A14=\"\",\"\",Lots!ER14)","v":""},{"$f":"IF(Lots!A14=\"\",\"\",IF(Lots!ES14=TRUE,\"B\",\"S\"))","v":""}]
[{"$f":"IF(Lots!A15=\"\",\"\",Lots!A15)","v":""},{"$f":"IF(Lots!A15=\"\",\"\",Lots!F15)","v":""},{"$f":"IF(Lots!A15=\"\",\"\",Lots!J15)","v":""},{"$f":"IF(Lots!A15=\"\",\"\",Lots!G15)","v":""},{"$f":"IF(Lots!A15=\"\",\"\",Lots!H15)","v":""},{"$f":"IF(Lots!A15=\"\",\"\",Lots!EA15)","v":""},{"$f":"IF(Lots!A15=\"\",\"\",Lots!EB15)","v":""},{"$f":"IF(Lots!A15=\"\",\"\",Lots!EK15)","v":""},{"$f":"IF(Lots!A15=\"\",\"\",Lots!EF15)","v":""},{"$f":"IF(Lots!F15=\"\",\"\",Lots!EG15)","v":""},{"$f":"IF(Lots!H15=\"\",\"\",Lots!EH15)","v":""},"",{"$f":"IF(A26=\"\",\"\",IF(Lots!ET15=TRUE,\"D\",\"S\"))","v":""},0,0,0,{"$f":"IF(Lots!A15=\"\",\"\",Lots!EM15)","v":""},{"$f":"IF(Lots!A15=\"\",\"\",Lots!EN15)","v":""},{"$f":"IF(Lots!A15=\"\",\"\",Lots!EO15)","v":""},{"$f":"IF(Lots!A15=\"\",\"\",Lots!EP15)","v":""},{"$f":"IF(Lots!A15=\"\",\"\",Lots!EQ15)","v":""},{"$f":"IF(Lots!A15=\"\",\"\",Lots!ER15)","v":""},{"$f":"IF(Lots!A15=\"\",\"\",IF(Lots!ES15=TRUE,\"B\",\"S\"))","v":""}]
[{"$f":"IF(Lots!A16=\"\",\"\",Lots!A16)","v":""},{"$f":"IF(Lots!A16=\"\",\"\",Lots!F16)","v":""},{"$f":"IF(Lots!A16=\"\",\"\",Lots!J16)","v":""},{"$f":"IF(Lots!A16=\"\",\"\",Lots!G16)","v":""},{"$f":"IF(Lots!A16=\"\",\"\",Lots!H16)","v":""},{"$f":"IF(Lots!A16=\"\",\"\",Lots!EA16)","v":""},{"$f":"IF(Lots!A16=\"\",\"\",Lots!EB16)","v":""},{"$f":"IF(Lots!A16=\"\",\"\",Lots!EK16)","v":""},{"$f":"IF(Lots!A16=\"\",\"\",Lots!EF16)","v":""},{"$f":"IF(Lots!F16=\"\",\"\",Lots!EG16)","v":""},{"$f":"IF(Lots!H16=\"\",\"\",Lots!EH16)","v":""},"",{"$f":"IF(A27=\"\",\"\",IF(Lots!ET16=TRUE,\"D\",\"S\"))","v":""},0,0,0,{"$f":"IF(Lots!A16=\"\",\"\",Lots!EM16)","v":""},{"$f":"IF(Lots!A16=\"\",\"\",Lots!EN16)","v":""},{"$f":"IF(Lots!A16=\"\",\"\",Lots!EO16)","v":""},{"$f":"IF(Lots!A16=\"\",\"\",Lots!EP16)","v":""},{"$f":"IF(Lots!A16=\"\",\"\",Lots!EQ16)","v":""},{"$f":"IF(Lots!A16=\"\",\"\",Lots!ER16)","v":""},{"$f":"IF(Lots!A16=\"\",\"\",IF(Lots!ES16=TRUE,\"B\",\"S\"))","v":""}]
[{"$f":"IF(Lots!A17=\"\",\"\",Lots!A17)","v":""},{"$f":"IF(Lots!A17=\"\",\"\",Lots!F17)","v":""},{"$f":"IF(Lots!A17=\"\",\"\",Lots!J17)","v":""},{"$f":"IF(Lots!A17=\"\",\"\",Lots!G17)","v":""},{"$f":"IF(Lots!A17=\"\",\"\",Lots!H17)","v":""},{"$f":"IF(Lots!A17=\"\",\"\",Lots!EA17)","v":""},{"$f":"IF(Lots!A17=\"\",\"\",Lots!EB17)","v":""},{"$f":"IF(Lots!A17=\"\",\"\",Lots!EK17)","v":""},{"$f":"IF(Lots!A17=\"\",\"\",Lots!EF17)","v":""},{"$f":"IF(Lots!F17=\"\",\"\",Lots!EG17)","v":""},{"$f":"IF(Lots!H17=\"\",\"\",Lots!EH17)","v":""},"",{"$f":"IF(A28=\"\",\"\",IF(Lots!ET17=TRUE,\"D\",\"S\"))","v":""},0,0,0,{"$f":"IF(Lots!A17=\"\",\"\",Lots!EM17)","v":""},{"$f":"IF(Lots!A17=\"\",\"\",Lots!EN17)","v":""},{"$f":"IF(Lots!A17=\"\",\"\",Lots!EO17)","v":""},{"$f":"IF(Lots!A17=\"\",\"\",Lots!EP17)","v":""},{"$f":"IF(Lots!A17=\"\",\"\",Lots!EQ17)","v":""},{"$f":"IF(Lots!A17=\"\",\"\",Lots!ER17)","v":""},{"$f":"IF(Lots!A17=\"\",\"\",IF(Lots!ES17=TRUE,\"B\",\"S\"))","v":""}]
[{"$f":"IF(Lots!A18=\"\",\"\",Lots!A18)","v":""},{"$f":"IF(Lots!A18=\"\",\"\",Lots!F18)","v":""},{"$f":"IF(Lots!A18=\"\",\"\",Lots!J18)","v":""},{"$f":"IF(Lots!A18=\"\",\"\",Lots!G18)","v":""},{"$f":"IF(Lots!A18=\"\",\"\",Lots!H18)","v":""},{"$f":"IF(Lots!A18=\"\",\"\",Lots!EA18)","v":""},{"$f":"IF(Lots!A18=\"\",\"\",Lots!EB18)","v":""},{"$f":"IF(Lots!A18=\"\",\"\",Lots!EK18)","v":""},{"$f":"IF(Lots!A18=\"\",\"\",Lots!EF18)","v":""},{"$f":"IF(Lots!F18=\"\",\"\",Lots!EG18)","v":""},{"$f":"IF(Lots!H18=\"\",\"\",Lots!EH18)","v":""},"",{"$f":"IF(A29=\"\",\"\",IF(Lots!ET18=TRUE,\"D\",\"S\"))","v":""},0,0,0,{"$f":"IF(Lots!A18=\"\",\"\",Lots!EM18)","v":""},{"$f":"IF(Lots!A18=\"\",\"\",Lots!EN18)","v":""},{"$f":"IF(Lots!A18=\"\",\"\",Lots!EO18)","v":""},{"$f":"IF(Lots!A18=\"\",\"\",Lots!EP18)","v":""},{"$f":"IF(Lots!A18=\"\",\"\",Lots!EQ18)","v":""},{"$f":"IF(Lots!A18=\"\",\"\",Lots!ER18)","v":""},{"$f":"IF(Lots!A18=\"\",\"\",IF(Lots!ES18=TRUE,\"B\",\"S\"))","v":""}]
[{"$f":"IF(Lots!A19=\"\",\"\",Lots!A19)","v":""},{"$f":"IF(Lots!A19=\"\",\"\",Lots!F19)","v":""},{"$f":"IF(Lots!A19=\"\",\"\",Lots!J19)","v":""},{"$f":"IF(Lots!A19=\"\",\"\",Lots!G19)","v":""},{"$f":"IF(Lots!A19=\"\",\"\",Lots!H19)","v":""},{"$f":"IF(Lots!A19=\"\",\"\",Lots!EA19)","v":""},{"$f":"IF(Lots!A19=\"\",\"\",Lots!EB19)","v":""},{"$f":"IF(Lots!A19=\"\",\"\",Lots!EK19)","v":""},{"$f":"IF(Lots!A19=\"\",\"\",Lots!EF19)","v":""},{"$f":"IF(Lots!F19=\"\",\"\",Lots!EG19)","v":""},{"$f":"IF(Lots!H19=\"\",\"\",Lots!EH19)","v":""},"",{"$f":"IF(A30=\"\",\"\",IF(Lots!ET19=TRUE,\"D\",\"S\"))","v":""},0,0,0,{"$f":"IF(Lots!A19=\"\",\"\",Lots!EM19)","v":""},{"$f":"IF(Lots!A19=\"\",\"\",Lots!EN19)","v":""},{"$f":"IF(Lots!A19=\"\",\"\",Lots!EO19)","v":""},{"$f":"IF(Lots!A19=\"\",\"\",Lots!EP19)","v":""},{"$f":"IF(Lots!A19=\"\",\"\",Lots!EQ19)","v":""},{"$f":"IF(Lots!A19=\"\",\"\",Lots!ER19)","v":""},{"$f":"IF(Lots!A19=\"\",\"\",IF(Lots!ES19=TRUE,\"B\",\"S\"))","v":""}]
[{"$f":"IF(Lots!A20=\"\",\"\",Lots!A20)","v":""},{"$f":"IF(Lots!A20=\"\",\"\",Lots!F20)","v":""},{"$f":"IF(Lots!A20=\"\",\"\",Lots!J20)","v":""},{"$f":"IF(Lots!A20=\"\",\"\",Lots!G20)","v":""},{"$f":"IF(Lots!A20=\"\",\"\",Lots!H20)","v":""},{"$f":"IF(Lots!A20=\"\",\"\",Lots!EA20)","v":""},{"$f":"IF(Lots!A20=\"\",\"\",Lots!EB20)","v":""},{"$f":"IF(Lots!A20=\"\",\"\",Lots!EK20)","v":""},{"$f":"IF(Lots!A20=\"\",\"\",Lots!EF20)","v":""},{"$f":"IF(Lots!F20=\"\",\"\",Lots!EG20)","v":""},{"$f":"IF(Lots!H20=\"\",\"\",Lots!EH20)","v":""},"",{"$f":"IF(A31=\"\",\"\",IF(Lots!ET20=TRUE,\"D\",\"S\"))","v":""},0,0,0,{"$f":"IF(Lots!A20=\"\",\"\",Lots!EM20)","v":""},{"$f":"IF(Lots!A20=\"\",\"\",Lots!EN20)","v":""},{"$f":"IF(Lots!A20=\"\",\"\",Lots!EO20)","v":""},{"$f":"IF(Lots!A20=\"\",\"\",Lots!EP20)","v":""},{"$f":"IF(Lots!A20=\"\",\"\",Lots!EQ20)","v":""},{"$f":"IF(Lots!A20=\"\",\"\",Lots!ER20)","v":""},{"$f":"IF(Lots!A20=\"\",\"\",IF(Lots!ES20=TRUE,\"B\",\"S\"))","v":""}]
[{"$f":"IF(Lots!A21=\"\",\"\",Lots!A21)","v":""},{"$f":"IF(Lots!A21=\"\",\"\",Lots!F21)","v":""},{"$f":"IF(Lots!A21=\"\",\"\",Lots!J21)","v":""},{"$f":"IF(Lots!A21=\"\",\"\",Lots!G21)","v":""},{"$f":"IF(Lots!A21=\"\",\"\",Lots!H21)","v":""},{"$f":"IF(Lots!A21=\"\",\"\",Lots!EA21)","v":""},{"$f":"IF(Lots!A21=\"\",\"\",Lots!EB21)","v":""},{"$f":"IF(Lots!A21=\"\",\"\",Lots!EK21)","v":""},{"$f":"IF(Lots!A21=\"\",\"\",Lots!EF21)","v":""},{"$f":"IF(Lots!F21=\"\",\"\",Lots!EG21)","v":""},{"$f":"IF(Lots!H21=\"\",\"\",Lots!EH21)","v":""},"",{"$f":"IF(A32=\"\",\"\",IF(Lots!ET21=TRUE,\"D\",\"S\"))","v":""},0,0,0,{"$f":"IF(Lots!A21=\"\",\"\",Lots!EM21)","v":""},{"$f":"IF(Lots!A21=\"\",\"\",Lots!EN21)","v":""},{"$f":"IF(Lots!A21=\"\",\"\",Lots!EO21)","v":""},{"$f":"IF(Lots!A21=\"\",\"\",Lots!EP21)","v":""},{"$f":"IF(Lots!A21=\"\",\"\",Lots!EQ21)","v":""},{"$f":"IF(Lots!A21=\"\",\"\",Lots!ER21)","v":""},{"$f":"IF(Lots!A21=\"\",\"\",IF(Lots!ES21=TRUE,\"B\",\"S\"))","v":""}]
[{"$f":"IF(Lots!A22=\"\",\"\",Lots!A22)","v":""},{"$f":"IF(Lots!A22=\"\",\"\",Lots!F22)","v":""},{"$f":"IF(Lots!A22=\"\",\"\",Lots!J22)","v":""},{"$f":"IF(Lots!A22=\"\",\"\",Lots!G22)","v":""},{"$f":"IF(Lots!A22=\"\",\"\",Lots!H22)","v":""},{"$f":"IF(Lots!A22=\"\",\"\",Lots!EA22)","v":""},{"$f":"IF(Lots!A22=\"\",\"\",Lots!EB22)","v":""},{"$f":"IF(Lots!A22=\"\",\"\",Lots!EK22)","v":""},{"$f":"IF(Lots!A22=\"\",\"\",Lots!EF22)","v":""},{"$f":"IF(Lots!F22=\"\",\"\",Lots!EG22)","v":""},{"$f":"IF(Lots!H22=\"\",\"\",Lots!EH22)","v":""},"",{"$f":"IF(A33=\"\",\"\",IF(Lots!ET22=TRUE,\"D\",\"S\"))","v":""},0,0,0,{"$f":"IF(Lots!A22=\"\",\"\",Lots!EM22)","v":""},{"$f":"IF(Lots!A22=\"\",\"\",Lots!EN22)","v":""},{"$f":"IF(Lots!A22=\"\",\"\",Lots!EO22)","v":""},{"$f":"IF(Lots!A22=\"\",\"\",Lots!EP22)","v":""},{"$f":"IF(Lots!A22=\"\",\"\",Lots!EQ22)","v":""},{"$f":"IF(Lots!A22=\"\",\"\",Lots!ER22)","v":""},{"$f":"IF(Lots!A22=\"\",\"\",IF(Lots!ES22=TRUE,\"B\",\"S\"))","v":""}]
[{"$f":"IF(Lots!A23=\"\",\"\",Lots!A23)","v":""},{"$f":"IF(Lots!A23=\"\",\"\",Lots!F23)","v":""},{"$f":"IF(Lots!A23=\"\",\"\",Lots!J23)","v":""},{"$f":"IF(Lots!A23=\"\",\"\",Lots!G23)","v":""},{"$f":"IF(Lots!A23=\"\",\"\",Lots!H23)","v":""},{"$f":"IF(Lots!A23=\"\",\"\",Lots!EA23)","v":""},{"$f":"IF(Lots!A23=\"\",\"\",Lots!EB23)","v":""},{"$f":"IF(Lots!A23=\"\",\"\",Lots!EK23)","v":""},{"$f":"IF(Lots!A23=\"\",\"\",Lots!EF23)","v":""},{"$f":"IF(Lots!F23=\"\",\"\",Lots!EG23)","v":""},{"$f":"IF(Lots!H23=\"\",\"\",Lots!EH23)","v":""},"",{"$f":"IF(A34=\"\",\"\",IF(Lots!ET23=TRUE,\"D\",\"S\"))","v":""},0,0,0,{"$f":"IF(Lots!A23=\"\",\"\",Lots!EM23)","v":""},{"$f":"IF(Lots!A23=\"\",\"\",Lots!EN23)","v":""},{"$f":"IF(Lots!A23=\"\",\"\",Lots!EO23)","v":""},{"$f":"IF(Lots!A23=\"\",\"\",Lots!EP23)","v":""},{"$f":"IF(Lots!A23=\"\",\"\",Lots!EQ23)","v":""},{"$f":"IF(Lots!A23=\"\",\"\",Lots!ER23)","v":""},{"$f":"IF(Lots!A23=\"\",\"\",IF(Lots!ES23=TRUE,\"B\",\"S\"))","v":""}]
[{"$f":"IF(Lots!A24=\"\",\"\",Lots!A24)","v":""},{"$f":"IF(Lots!A24=\"\",\"\",Lots!F24)","v":""},{"$f":"IF(Lots!A24=\"\",\"\",Lots!J24)","v":""},{"$f":"IF(Lots!A24=\"\",\"\",Lots!G24)","v":""},{"$f":"IF(Lots!A24=\"\",\"\",Lots!H24)","v":""},{"$f":"IF(Lots!A24=\"\",\"\",Lots!EA24)","v":""},{"$f":"IF(Lots!A24=\"\",\"\",Lots!EB24)","v":""},{"$f":"IF(Lots!A24=\"\",\"\",Lots!EK24)","v":""},{"$f":"IF(Lots!A24=\"\",\"\",Lots!EF24)","v":""},{"$f":"IF(Lots!F24=\"\",\"\",Lots!EG24)","v":""},{"$f":"IF(Lots!H24=\"\",\"\",Lots!EH24)","v":""},"",{"$f":"IF(A35=\"\",\"\",IF(Lots!ET24=TRUE,\"D\",\"S\"))","v":""},0,0,0,{"$f":"IF(Lots!A24=\"\",\"\",Lots!EM24)","v":""},{"$f":"IF(Lots!A24=\"\",\"\",Lots!EN24)","v":""},{"$f":"IF(Lots!A24=\"\",\"\",Lots!EO24)","v":""},{"$f":"IF(Lots!A24=\"\",\"\",Lots!EP24)","v":""},{"$f":"IF(Lots!A24=\"\",\"\",Lots!EQ24)","v":""},{"$f":"IF(Lots!A24=\"\",\"\",Lots!ER24)","v":""},{"$f":"IF(Lots!A24=\"\",\"\",IF(Lots!ES24=TRUE,\"B\",\"S\"))","v":""}]
[{"$f":"IF(Lots!A25=\"\",\"\",Lots!A25)","v":""},{"$f":"IF(Lots!A25=\"\",\"\",Lots!F25)","v":""},{"$f":"IF(Lots!A25=\"\",\"\",Lots!J25)","v":""},{"$f":"IF(Lots!A25=\"\",\"\",Lots!G25)","v":""},{"$f":"IF(Lots!A25=\"\",\"\",Lots!H25)","v":""},{"$f":"IF(Lots!A25=\"\",\"\",Lots!EA25)","v":""},{"$f":"IF(Lots!A25=\"\",\"\",Lots!EB25)","v":""},{"$f":"IF(Lots!A25=\"\",\"\",Lots!EK25)","v":""},{"$f":"IF(Lots!A25=\"\",\"\",Lots!EF25)","v":""},{"$f":"IF(Lots!F25=\"\",\"\",Lots!EG25)","v":""},{"$f":"IF(Lots!H25=\"\",\"\",Lots!EH25)","v":""},"",{"$f":"IF(A36=\"\",\"\",IF(Lots!ET25=TRUE,\"D\",\"S\"))","v":""},0,0,0,{"$f":"IF(Lots!A25=\"\",\"\",Lots!EM25)","v":""},{"$f":"IF(Lots!A25=\"\",\"\",Lots!EN25)","v":""},{"$f":"IF(Lots!A25=\"\",\"\",Lots!EO25)","v":""},{"$f":"IF(Lots!A25=\"\",\"\",Lots!EP25)","v":""},{"$f":"IF(Lots!A25=\"\",\"\",Lots!EQ25)","v":""},{"$f":"IF(Lots!A25=\"\",\"\",Lots!ER25)","v":""},{"$f":"IF(Lots!A25=\"\",\"\",IF(Lots!ES25=TRUE,\"B\",\"S\"))","v":""}]
[{"$f":"IF(Lots!A26=\"\",\"\",Lots!A26)","v":""},{"$f":"IF(Lots!A26=\"\",\"\",Lots!F26)","v":""},{"$f":"IF(Lots!A26=\"\",\"\",Lots!J26)","v":""},{"$f":"IF(Lots!A26=\"\",\"\",Lots!G26)","v":""},{"$f":"IF(Lots!A26=\"\",\"\",Lots!H26)","v":""},{"$f":"IF(Lots!A26=\"\",\"\",Lots!EA26)","v":""},{"$f":"IF(Lots!A26=\"\",\"\",Lots!EB26)","v":""},{"$f":"IF(Lots!A26=\"\",\"\",Lots!EK26)","v":""},{"$f":"IF(Lots!A26=\"\",\"\",Lots!EF26)","v":""},{"$f":"IF(Lots!F26=\"\",\"\",Lots!EG26)","v":""},{"$f":"IF(Lots!H26=\"\",\"\",Lots!EH26)","v":""},"",{"$f":"IF(A37=\"\",\"\",IF(Lots!ET26=TRUE,\"D\",\"S\"))","v":""},0,0,0,{"$f":"IF(Lots!A26=\"\",\"\",Lots!EM26)","v":""},{"$f":"IF(Lots!A26=\"\",\"\",Lots!EN26)","v":""},{"$f":"IF(Lots!A26=\"\",\"\",Lots!EO26)","v":""},{"$f":"IF(Lots!A26=\"\",\"\",Lots!EP26)","v":""},{"$f":"IF(Lots!A26=\"\",\"\",Lots!EQ26)","v":""},{"$f":"IF(Lots!A26=\"\",\"\",Lots!ER26)","v":""},{"$f":"IF(Lots!A26=\"\",\"\",IF(Lots!ES26=TRUE,\"B\",\"S\"))","v":""}]
[{"$f":"IF(Lots!A27=\"\",\"\",Lots!A27)","v":""},{"$f":"IF(Lots!A27=\"\",\"\",Lots!F27)","v":""},{"$f":"IF(Lots!A27=\"\",\"\",Lots!J27)","v":""},{"$f":"IF(Lots!A27=\"\",\"\",Lots!G27)","v":""},{"$f":"IF(Lots!A27=\"\",\"\",Lots!H27)","v":""},{"$f":"IF(Lots!A27=\"\",\"\",Lots!EA27)","v":""},{"$f":"IF(Lots!A27=\"\",\"\",Lots!EB27)","v":""},{"$f":"IF(Lots!A27=\"\",\"\",Lots!EK27)","v":""},{"$f":"IF(Lots!A27=\"\",\"\",Lots!EF27)","v":""},{"$f":"IF(Lots!F27=\"\",\"\",Lots!EG27)","v":""},{"$f":"IF(Lots!H27=\"\",\"\",Lots!EH27)","v":""},"",{"$f":"IF(A38=\"\",\"\",IF(Lots!ET27=TRUE,\"D\",\"S\"))","v":""},0,0,0,{"$f":"IF(Lots!A27=\"\",\"\",Lots!EM27)","v":""},{"$f":"IF(Lots!A27=\"\",\"\",Lots!EN27)","v":""},{"$f":"IF(Lots!A27=\"\",\"\",Lots!EO27)","v":""},{"$f":"IF(Lots!A27=\"\",\"\",Lots!EP27)","v":""},{"$f":"IF(Lots!A27=\"\",\"\",Lots!EQ27)","v":""},{"$f":"IF(Lots!A27=\"\",\"\",Lots!ER27)","v":""},{"$f":"IF(Lots!A27=\"\",\"\",IF(Lots!ES27=TRUE,\"B\",\"S\"))","v":""}]
[{"$f":"IF(Lots!A28=\"\",\"\",Lots!A28)","v":""},{"$f":"IF(Lots!A28=\"\",\"\",Lots!F28)","v":""},{"$f":"IF(Lots!A28=\"\",\"\",Lots!J28)","v":""},{"$f":"IF(Lots!A28=\"\",\"\",Lots!G28)","v":""},{"$f":"IF(Lots!A28=\"\",\"\",Lots!H28)","v":""},{"$f":"IF(Lots!A28=\"\",\"\",Lots!EA28)","v":""},{"$f":"IF(Lots!A28=\"\",\"\",Lots!EB28)","v":""},{"$f":"IF(Lots!A28=\"\",\"\",Lots!EK28)","v":""},{"$f":"IF(Lots!A28=\"\",\"\",Lots!EF28)","v":""},{"$f":"IF(Lots!F28=\"\",\"\",Lots!EG28)","v":""},{"$f":"IF(Lots!H28=\"\",\"\",Lots!EH28)","v":""},"",{"$f":"IF(A39=\"\",\"\",IF(Lots!ET28=TRUE,\"D\",\"S\"))","v":""},0,0,0,{"$f":"IF(Lots!A28=\"\",\"\",Lots!EM28)","v":""},{"$f":"IF(Lots!A28=\"\",\"\",Lots!EN28)","v":""},{"$f":"IF(Lots!A28=\"\",\"\",Lots!EO28)","v":""},{"$f":"IF(Lots!A28=\"\",\"\",Lots!EP28)","v":""},{"$f":"IF(Lots!A28=\"\",\"\",Lots!EQ28)","v":""},{"$f":"IF(Lots!A28=\"\",\"\",Lots!ER28)","v":""},{"$f":"IF(Lots!A28=\"\",\"\",IF(Lots!ES28=TRUE,\"B\",\"S\"))","v":""}]
[{"$f":"IF(Lots!A29=\"\",\"\",Lots!A29)","v":""},{"$f":"IF(Lots!A29=\"\",\"\",Lots!F29)","v":""},{"$f":"IF(Lots!A29=\"\",\"\",Lots!J29)","v":""},{"$f":"IF(Lots!A29=\"\",\"\",Lots!G29)","v":""},{"$f":"IF(Lots!A29=\"\",\"\",Lots!H29)","v":""},{"$f":"IF(Lots!A29=\"\",\"\",Lots!EA29)","v":""},{"$f":"IF(Lots!A29=\"\",\"\",Lots!EB29)","v":""},{"$f":"IF(Lots!A29=\"\",\"\",Lots!EK29)","v":""},{"$f":"IF(Lots!A29=\"\",\"\",Lots!EF29)","v":""},{"$f":"IF(Lots!F29=\"\",\"\",Lots!EG29)","v":""},{"$f":"IF(Lots!H29=\"\",\"\",Lots!EH29)","v":""},"",{"$f":"IF(A40=\"\",\"\",IF(Lots!ET29=TRUE,\"D\",\"S\"))","v":""},0,0,0,{"$f":"IF(Lots!A29=\"\",\"\",Lots!EM29)","v":""},{"$f":"IF(Lots!A29=\"\",\"\",Lots!EN29)","v":""},{"$f":"IF(Lots!A29=\"\",\"\",Lots!EO29)","v":""},{"$f":"IF(Lots!A29=\"\",\"\",Lots!EP29)","v":""},{"$f":"IF(Lots!A29=\"\",\"\",Lots!EQ29)","v":""},{"$f":"IF(Lots!A29=\"\",\"\",Lots!ER29)","v":""},{"$f":"IF(Lots!A29=\"\",\"\",IF(Lots!ES29=TRUE,\"B\",\"S\"))","v":""}]
[{"$f":"IF(Lots!A30=\"\",\"\",Lots!A30)","v":""},{"$f":"IF(Lots!A30=\"\",\"\",Lots!F30)","v":""},{"$f":"IF(Lots!A30=\"\",\"\",Lots!J30)","v":""},{"$f":"IF(Lots!A30=\"\",\"\",Lots!G30)","v":""},{"$f":"IF(Lots!A30=\"\",\"\",Lots!H30)","v":""},{"$f":"IF(Lots!A30=\"\",\"\",Lots!EA30)","v":""},{"$f":"IF(Lots!A30=\"\",\"\",Lots!EB30)","v":""},{"$f":"IF(Lots!A30=\"\",\"\",Lots!EK30)","v":""},{"$f":"IF(Lots!A30=\"\",\"\",Lots!EF30)","v":""},{"$f":"IF(Lots!F30=\"\",\"\",Lots!EG30)","v":""},{"$f":"IF(Lots!H30=\"\",\"\",Lots!EH30)","v":""},"",{"$f":"IF(A41=\"\",\"\",IF(Lots!ET30=TRUE,\"D\",\"S\"))","v":""},0,0,0,{"$f":"IF(Lots!A30=\"\",\"\",Lots!EM30)","v":""},{"$f":"IF(Lots!A30=\"\",\"\",Lots!EN30)","v":""},{"$f":"IF(Lots!A30=\"\",\"\",Lots!EO30)","v":""},{"$f":"IF(Lots!A30=\"\",\"\",Lots!EP30)","v":""},{"$f":"IF(Lots!A30=\"\",\"\",Lots!EQ30)","v":""},{"$f":"IF(Lots!A30=\"\",\"\",Lots!ER30)","v":""},{"$f":"IF(Lots!A30=\"\",\"\",IF(Lots!ES30=TRUE,\"B\",\"S\"))","v":""}]
[{"$f":"IF(Lots!A31=\"\",\"\",Lots!A31)","v":""},{"$f":"IF(Lots!A31=\"\",\"\",Lots!F31)","v":""},{"$f":"IF(Lots!A31=\"\",\"\",Lots!J31)","v":""},{"$f":"IF(Lots!A31=\"\",\"\",Lots!G31)","v":""},{"$f":"IF(Lots!A31=\"\",\"\",Lots!H31)","v":""},{"$f":"IF(Lots!A31=\"\",\"\",Lots!EA31)","v":""},{"$f":"IF(Lots!A31=\"\",\"\",Lots!EB31)","v":""},{"$f":"IF(Lots!A31=\"\",\"\",Lots!EK31)","v":""},{"$f":"IF(Lots!A31=\"\",\"\",Lots!EF31)","v":""},{"$f":"IF(Lots!F31=\"\",\"\",Lots!EG31)","v":""},{"$f":"IF(Lots!H31=\"\",\"\",Lots!EH31)","v":""},"",{"$f":"IF(A42=\"\",\"\",IF(Lots!ET31=TRUE,\"D\",\"S\"))","v":""},0,0,0,{"$f":"IF(Lots!A31=\"\",\"\",Lots!EM31)","v":""},{"$f":"IF(Lots!A31=\"\",\"\",Lots!EN31)","v":""},{"$f":"IF(Lots!A31=\"\",\"\",Lots!EO31)","v":""},{"$f":"IF(Lots!A31=\"\",\"\",Lots!EP31)","v":""},{"$f":"IF(Lots!A31=\"\",\"\",Lots!EQ31)","v":""},{"$f":"IF(Lots!A31=\"\",\"\",Lots!ER31)","v":""},{"$f":"IF(Lots!A31=\"\",\"\",IF(Lots!ES31=TRUE,\"B\",\"S\"))","v":""}]
[{"$f":"IF(Lots!A32=\"\",\"\",Lots!A32)","v":""},{"$f":"IF(Lots!A32=\"\",\"\",Lots!F32)","v":""},{"$f":"IF(Lots!A32=\"\",\"\",Lots!J32)","v":""},{"$f":"IF(Lots!A32=\"\",\"\",Lots!G32)","v":""},{"$f":"IF(Lots!A32=\"\",\"\",Lots!H32)","v":""},{"$f":"IF(Lots!A32=\"\",\"\",Lots!EA32)","v":""},{"$f":"IF(Lots!A32=\"\",\"\",Lots!EB32)","v":""},{"$f":"IF(Lots!A32=\"\",\"\",Lots!EK32)","v":""},{"$f":"IF(Lots!A32=\"\",\"\",Lots!EF32)","v":""},{"$f":"IF(Lots!F32=\"\",\"\",Lots!EG32)","v":""},{"$f":"IF(Lots!H32=\"\",\"\",Lots!EH32)","v":""},"",{"$f":"IF(A43=\"\",\"\",IF(Lots!ET32=TRUE,\"D\",\"S\"))","v":""},0,0,0,{"$f":"IF(Lots!A32=\"\",\"\",Lots!EM32)","v":""},{"$f":"IF(Lots!A32=\"\",\"\",Lots!EN32)","v":""},{"$f":"IF(Lots!A32=\"\",\"\",Lots!EO32)","v":""},{"$f":"IF(Lots!A32=\"\",\"\",Lots!EP32)","v":""},{"$f":"IF(Lots!A32=\"\",\"\",Lots!EQ32)","v":""},{"$f":"IF(Lots!A32=\"\",\"\",Lots!ER32)","v":""},{"$f":"IF(Lots!A32=\"\",\"\",IF(Lots!ES32=TRUE,\"B\",\"S\"))","v":""}]
[{"$f":"IF(Lots!A33=\"\",\"\",Lots!A33)","v":""},{"$f":"IF(Lots!A33=\"\",\"\",Lots!F33)","v":""},{"$f":"IF(Lots!A33=\"\",\"\",Lots!J33)","v":""},{"$f":"IF(Lots!A33=\"\",\"\",Lots!G33)","v":""},{"$f":"IF(Lots!A33=\"\",\"\",Lots!H33)","v":""},{"$f":"IF(Lots!A33=\"\",\"\",Lots!EA33)","v":""},{"$f":"IF(Lots!A33=\"\",\"\",Lots!EB33)","v":""},{"$f":"IF(Lots!A33=\"\",\"\",Lots!EK33)","v":""},{"$f":"IF(Lots!A33=\"\",\"\",Lots!EF33)","v":""},{"$f":"IF(Lots!F33=\"\",\"\",Lots!EG33)","v":""},{"$f":"IF(Lots!H33=\"\",\"\",Lots!EH33)","v":""},"",{"$f":"IF(A44=\"\",\"\",IF(Lots!ET33=TRUE,\"D\",\"S\"))","v":""},0,0,0,{"$f":"IF(Lots!A33=\"\",\"\",Lots!EM33)","v":""},{"$f":"IF(Lots!A33=\"\",\"\",Lots!EN33)","v":""},{"$f":"IF(Lots!A33=\"\",\"\",Lots!EO33)","v":""},{"$f":"IF(Lots!A33=\"\",\"\",Lots!EP33)","v":""},{"$f":"IF(Lots!A33=\"\",\"\",Lots!EQ33)","v":""},{"$f":"IF(Lots!A33=\"\",\"\",Lots!ER33)","v":""},{"$f":"IF(Lots!A33=\"\",\"\",IF(Lots!ES33=TRUE,\"B\",\"S\"))","v":""}]
[{"$f":"IF(Lots!A34=\"\",\"\",Lots!A34)","v":""},{"$f":"IF(Lots!A34=\"\",\"\",Lots!F34)","v":""},{"$f":"IF(Lots!A34=\"\",\"\",Lots!J34)","v":""},{"$f":"IF(Lots!A34=\"\",\"\",Lots!G34)","v":""},{"$f":"IF(Lots!A34=\"\",\"\",Lots!H34)","v":""},{"$f":"IF(Lots!A34=\"\",\"\",Lots!EA34)","v":""},{"$f":"IF(Lots!A34=\"\",\"\",Lots!EB34)","v":""},{"$f":"IF(Lots!A34=\"\",\"\",Lots!EK34)","v":""},{"$f":"IF(Lots!A34=\"\",\"\",Lots!EF34)","v":""},{"$f":"IF(Lots!F34=\"\",\"\",Lots!EG34)","v":""},{"$f":"IF(Lots!H34=\"\",\"\",Lots!EH34)","v":""},"",{"$f":"IF(A45=\"\",\"\",IF(Lots!ET34=TRUE,\"D\",\"S\"))","v":""},0,0,0,{"$f":"IF(Lots!A34=\"\",\"\",Lots!EM34)","v":""},{"$f":"IF(Lots!A34=\"\",\"\",Lots!EN34)","v":""},{"$f":"IF(Lots!A34=\"\",\"\",Lots!EO34)","v":""},{"$f":"IF(Lots!A34=\"\",\"\",Lots!EP34)","v":""},{"$f":"IF(Lots!A34=\"\",\"\",Lots!EQ34)","v":""},{"$f":"IF(Lots!A34=\"\",\"\",Lots!ER34)","v":""},{"$f":"IF(Lots!A34=\"\",\"\",IF(Lots!ES34=TRUE,\"B\",\"S\"))","v":""}]
[{"$f":"IF(Lots!A35=\"\",\"\",Lots!A35)","v":""},{"$f":"IF(Lots!A35=\"\",\"\",Lots!F35)","v":""},{"$f":"IF(Lots!A35=\"\",\"\",Lots!J35)","v":""},{"$f":"IF(Lots!A35=\"\",\"\",Lots!G35)","v":""},{"$f":"IF(Lots!A35=\"\",\"\",Lots!H35)","v":""},{"$f":"IF(Lots!A35=\"\",\"\",Lots!EA35)","v":""},{"$f":"IF(Lots!A35=\"\",\"\",Lots!EB35)","v":""},{"$f":"IF(Lots!A35=\"\",\"\",Lots!EK35)","v":""},{"$f":"IF(Lots!A35=\"\",\"\",Lots!EF35)","v":""},{"$f":"IF(Lots!F35=\"\",\"\",Lots!EG35)","v":""},{"$f":"IF(Lots!H35=\"\",\"\",Lots!EH35)","v":""},"",{"$f":"IF(A46=\"\",\"\",IF(Lots!ET35=TRUE,\"D\",\"S\"))","v":""},0,0,0,{"$f":"IF(Lots!A35=\"\",\"\",Lots!EM35)","v":""},{"$f":"IF(Lots!A35=\"\",\"\",Lots!EN35)","v":""},{"$f":"IF(Lots!A35=\"\",\"\",Lots!EO35)","v":""},{"$f":"IF(Lots!A35=\"\",\"\",Lots!EP35)","v":""},{"$f":"IF(Lots!A35=\"\",\"\",Lots!EQ35)","v":""},{"$f":"IF(Lots!A35=\"\",\"\",Lots!ER35)","v":""},{"$f":"IF(Lots!A35=\"\",\"\",IF(Lots!ES35=TRUE,\"B\",\"S\"))","v":""}]
[{"$f":"IF(Lots!A36=\"\",\"\",Lots!A36)","v":""},{"$f":"IF(Lots!A36=\"\",\"\",Lots!F36)","v":""},{"$f":"IF(Lots!A36=\"\",\"\",Lots!J36)","v":""},{"$f":"IF(Lots!A36=\"\",\"\",Lots!G36)","v":""},{"$f":"IF(Lots!A36=\"\",\"\",Lots!H36)","v":""},{"$f":"IF(Lots!A36=\"\",\"\",Lots!EA36)","v":""},{"$f":"IF(Lots!A36=\"\",\"\",Lots!EB36)","v":""},{"$f":"IF(Lots!A36=\"\",\"\",Lots!EK36)","v":""},{"$f":"IF(Lots!A36=\"\",\"\",Lots!EF36)","v":""},{"$f":"IF(Lots!F36=\"\",\"\",Lots!EG36)","v":""},{"$f":"IF(Lots!H36=\"\",\"\",Lots!EH36)","v":""},"",{"$f":"IF(A47=\"\",\"\",IF(Lots!ET36=TRUE,\"D\",\"S\"))","v":""},0,0,0,{"$f":"IF(Lots!A36=\"\",\"\",Lots!EM36)","v":""},{"$f":"IF(Lots!A36=\"\",\"\",Lots!EN36)","v":""},{"$f":"IF(Lots!A36=\"\",\"\",Lots!EO36)","v":""},{"$f":"IF(Lots!A36=\"\",\"\",Lots!EP36)","v":""},{"$f":"IF(Lots!A36=\"\",\"\",Lots!EQ36)","v":""},{"$f":"IF(Lots!A36=\"\",\"\",Lots!ER36)","v":""},{"$f":"IF(Lots!A36=\"\",\"\",IF(Lots!ES36=TRUE,\"B\",\"S\"))","v":""}]
[{"$f":"IF(Lots!A37=\"\",\"\",Lots!A37)","v":""},{"$f":"IF(Lots!A37=\"\",\"\",Lots!F37)","v":""},{"$f":"IF(Lots!A37=\"\",\"\",Lots!J37)","v":""},{"$f":"IF(Lots!A37=\"\",\"\",Lots!G37)","v":""},{"$f":"IF(Lots!A37=\"\",\"\",Lots!H37)","v":""},{"$f":"IF(Lots!A37=\"\",\"\",Lots!EA37)","v":""},{"$f":"IF(Lots!A37=\"\",\"\",Lots!EB37)","v":""},{"$f":"IF(Lots!A37=\"\",\"\",Lots!EK37)","v":""},{"$f":"IF(Lots!A37=\"\",\"\",Lots!EF37)","v":""},{"$f":"IF(Lots!F37=\"\",\"\",Lots!EG37)","v":""},{"$f":"IF(Lots!H37=\"\",\"\",Lots!EH37)","v":""},"",{"$f":"IF(A48=\"\",\"\",IF(Lots!ET37=TRUE,\"D\",\"S\"))","v":""},0,0,0,{"$f":"IF(Lots!A37=\"\",\"\",Lots!EM37)","v":""},{"$f":"IF(Lots!A37=\"\",\"\",Lots!EN37)","v":""},{"$f":"IF(Lots!A37=\"\",\"\",Lots!EO37)","v":""},{"$f":"IF(Lots!A37=\"\",\"\",Lots!EP37)","v":""},{"$f":"IF(Lots!A37=\"\",\"\",Lots!EQ37)","v":""},{"$f":"IF(Lots!A37=\"\",\"\",Lots!ER37)","v":""},{"$f":"IF(Lots!A37=\"\",\"\",IF(Lots!ES37=TRUE,\"B\",\"S\"))","v":""}]
[{"$f":"IF(Lots!A38=\"\",\"\",Lots!A38)","v":""},{"$f":"IF(Lots!A38=\"\",\"\",Lots!F38)","v":""},{"$f":"IF(Lots!A38=\"\",\"\",Lots!J38)","v":""},{"$f":"IF(Lots!A38=\"\",\"\",Lots!G38)","v":""},{"$f":"IF(Lots!A38=\"\",\"\",Lots!H38)","v":""},{"$f":"IF(Lots!A38=\"\",\"\",Lots!EA38)","v":""},{"$f":"IF(Lots!A38=\"\",\"\",Lots!EB38)","v":""},{"$f":"IF(Lots!A38=\"\",\"\",Lots!EK38)","v":""},{"$f":"IF(Lots!A38=\"\",\"\",Lots!EF38)","v":""},{"$f":"IF(Lots!F38=\"\",\"\",Lots!EG38)","v":""},{"$f":"IF(Lots!H38=\"\",\"\",Lots!EH38)","v":""},"",{"$f":"IF(A49=\"\",\"\",IF(Lots!ET38=TRUE,\"D\",\"S\"))","v":""},0,0,0,{"$f":"IF(Lots!A38=\"\",\"\",Lots!EM38)","v":""},{"$f":"IF(Lots!A38=\"\",\"\",Lots!EN38)","v":""},{"$f":"IF(Lots!A38=\"\",\"\",Lots!EO38)","v":""},{"$f":"IF(Lots!A38=\"\",\"\",Lots!EP38)","v":""},{"$f":"IF(Lots!A38=\"\",\"\",Lots!EQ38)","v":""},{"$f":"IF(Lots!A38=\"\",\"\",Lots!ER38)","v":""},{"$f":"IF(Lots!A38=\"\",\"\",IF(Lots!ES38=TRUE,\"B\",\"S\"))","v":""}]
[{"$f":"IF(Lots!A39=\"\",\"\",Lots!A39)","v":""},{"$f":"IF(Lots!A39=\"\",\"\",Lots!F39)","v":""},{"$f":"IF(Lots!A39=\"\",\"\",Lots!J39)","v":""},{"$f":"IF(Lots!A39=\"\",\"\",Lots!G39)","v":""},{"$f":"IF(Lots!A39=\"\",\"\",Lots!H39)","v":""},{"$f":"IF(Lots!A39=\"\",\"\",Lots!EA39)","v":""},{"$f":"IF(Lots!A39=\"\",\"\",Lots!EB39)","v":""},{"$f":"IF(Lots!A39=\"\",\"\",Lots!EK39)","v":""},{"$f":"IF(Lots!A39=\"\",\"\",Lots!EF39)","v":""},{"$f":"IF(Lots!F39=\"\",\"\",Lots!EG39)","v":""},{"$f":"IF(Lots!H39=\"\",\"\",Lots!EH39)","v":""},"",{"$f":"IF(A50=\"\",\"\",IF(Lots!ET39=TRUE,\"D\",\"S\"))","v":""},0,0,0,{"$f":"IF(Lots!A39=\"\",\"\",Lots!EM39)","v":""},{"$f":"IF(Lots!A39=\"\",\"\",Lots!EN39)","v":""},{"$f":"IF(Lots!A39=\"\",\"\",Lots!EO39)","v":""},{"$f":"IF(Lots!A39=\"\",\"\",Lots!EP39)","v":""},{"$f":"IF(Lots!A39=\"\",\"\",Lots!EQ39)","v":""},{"$f":"IF(Lots!A39=\"\",\"\",Lots!ER39)","v":""},{"$f":"IF(Lots!A39=\"\",\"\",IF(Lots!ES39=TRUE,\"B\",\"S\"))","v":""}]
[{"$f":"IF(Lots!A40=\"\",\"\",Lots!A40)","v":""},{"$f":"IF(Lots!A40=\"\",\"\",Lots!F40)","v":""},{"$f":"IF(Lots!A40=\"\",\"\",Lots!J40)","v":""},{"$f":"IF(Lots!A40=\"\",\"\",Lots!G40)","v":""},{"$f":"IF(Lots!A40=\"\",\"\",Lots!H40)","v":""},{"$f":"IF(Lots!A40=\"\",\"\",Lots!EA40)","v":""},{"$f":"IF(Lots!A40=\"\",\"\",Lots!EB40)","v":""},{"$f":"IF(Lots!A40=\"\",\"\",Lots!EK40)","v":""},{"$f":"IF(Lots!A40=\"\",\"\",Lots!EF40)","v":""},{"$f":"IF(Lots!F40=\"\",\"\",Lots!EG40)","v":""},{"$f":"IF(Lots!H40=\"\",\"\",Lots!EH40)","v":""},"",{"$f":"IF(A51=\"\",\"\",IF(Lots!ET40=TRUE,\"D\",\"S\"))","v":""},0,0,0,{"$f":"IF(Lots!A40=\"\",\"\",Lots!EM40)","v":""},{"$f":"IF(Lots!A40=\"\",\"\",Lots!EN40)","v":""},{"$f":"IF(Lots!A40=\"\",\"\",Lots!EO40)","v":""},{"$f":"IF(Lots!A40=\"\",\"\",Lots!EP40)","v":""},{"$f":"IF(Lots!A40=\"\",\"\",Lots!EQ40)","v":""},{"$f":"IF(Lots!A40=\"\",\"\",Lots!ER40)","v":""},{"$f":"IF(Lots!A40=\"\",\"\",IF(Lots!ES40=TRUE,\"B\",\"S\"))","v":""}]
[{"$f":"IF(Lots!A41=\"\",\"\",Lots!A41)","v":""},{"$f":"IF(Lots!A41=\"\",\"\",Lots!F41)","v":""},{"$f":"IF(Lots!A41=\"\",\"\",Lots!J41)","v":""},{"$f":"IF(Lots!A41=\"\",\"\",Lots!G41)","v":""},{"$f":"IF(Lots!A41=\"\",\"\",Lots!H41)","v":""},{"$f":"IF(Lots!A41=\"\",\"\",Lots!EA41)","v":""},{"$f":"IF(Lots!A41=\"\",\"\",Lots!EB41)","v":""},{"$f":"IF(Lots!A41=\"\",\"\",Lots!EK41)","v":""},{"$f":"IF(Lots!A41=\"\",\"\",Lots!EF41)","v":""},{"$f":"IF(Lots!F41=\"\",\"\",Lots!EG41)","v":""},{"$f":"IF(Lots!H41=\"\",\"\",Lots!EH41)","v":""},"",{"$f":"IF(A52=\"\",\"\",IF(Lots!ET41=TRUE,\"D\",\"S\"))","v":""},{"$f":"IF(A52=\"\",0,$A$8/100*D52*B52)","v":0},{"$f":"IF(A52=\"\",0,$A$8/100*E52*C52)","v":0},{"$f":"IF(I52>50,0,L52)","v":0},{"$f":"IF(Lots!A41=\"\",\"\",Lots!EM41)","v":""},{"$f":"IF(Lots!A41=\"\",\"\",Lots!EN41)","v":""},{"$f":"IF(Lots!A41=\"\",\"\",Lots!EO41)","v":""},{"$f":"IF(Lots!A41=\"\",\"\",Lots!EP41)","v":""},{"$f":"IF(Lots!A41=\"\",\"\",Lots!EQ41)","v":""},{"$f":"IF(Lots!A41=\"\",\"\",Lots!ER41)","v":""},{"$f":"IF(Lots!A41=\"\",\"\",IF(Lots!ES41=TRUE,\"B\",\"S\"))","v":""}]
[{"$f":"IF(Lots!A42=\"\",\"\",Lots!A42)","v":""},{"$f":"IF(Lots!A42=\"\",\"\",Lots!F42)","v":""},{"$f":"IF(Lots!A42=\"\",\"\",Lots!J42)","v":""},{"$f":"IF(Lots!A42=\"\",\"\",Lots!G42)","v":""},{"$f":"IF(Lots!A42=\"\",\"\",Lots!H42)","v":""},{"$f":"IF(Lots!A42=\"\",\"\",Lots!EA42)","v":""},{"$f":"IF(Lots!A42=\"\",\"\",Lots!EB42)","v":""},{"$f":"IF(Lots!A42=\"\",\"\",Lots!EK42)","v":""},{"$f":"IF(Lots!A42=\"\",\"\",Lots!EF42)","v":""},{"$f":"IF(Lots!F42=\"\",\"\",Lots!EG42)","v":""},{"$f":"IF(Lots!H42=\"\",\"\",Lots!EH42)","v":""},"",{"$f":"IF(A53=\"\",\"\",IF(Lots!ET42=TRUE,\"D\",\"S\"))","v":""},0,0,0,{"$f":"IF(Lots!A42=\"\",\"\",Lots!EM42)","v":""},{"$f":"IF(Lots!A42=\"\",\"\",Lots!EN42)","v":""},{"$f":"IF(Lots!A42=\"\",\"\",Lots!EO42)","v":""},{"$f":"IF(Lots!A42=\"\",\"\",Lots!EP42)","v":""},{"$f":"IF(Lots!A42=\"\",\"\",Lots!EQ42)","v":""},{"$f":"IF(Lots!A42=\"\",\"\",Lots!ER42)","v":""},{"$f":"IF(Lots!A42=\"\",\"\",IF(Lots!ES42=TRUE,\"B\",\"S\"))","v":""}]
[{"$f":"IF(Lots!A43=\"\",\"\",Lots!A43)","v":""},{"$f":"IF(Lots!A43=\"\",\"\",Lots!F43)","v":""},{"$f":"IF(Lots!A43=\"\",\"\",Lots!J43)","v":""},{"$f":"IF(Lots!A43=\"\",\"\",Lots!G43)","v":""},{"$f":"IF(Lots!A43=\"\",\"\",Lots!H43)","v":""},{"$f":"IF(Lots!A43=\"\",\"\",Lots!EA43)","v":""},{"$f":"IF(Lots!A43=\"\",\"\",Lots!EB43)","v":""},{"$f":"IF(Lots!A43=\"\",\"\",Lots!EK43)","v":""},{"$f":"IF(Lots!A43=\"\",\"\",Lots!EF43)","v":""},{"$f":"IF(Lots!F43=\"\",\"\",Lots!EG43)","v":""},{"$f":"IF(Lots!H43=\"\",\"\",Lots!EH43)","v":""},"",{"$f":"IF(A54=\"\",\"\",IF(Lots!ET43=TRUE,\"D\",\"S\"))","v":""},0,0,0,{"$f":"IF(Lots!A43=\"\",\"\",Lots!EM43)","v":""},{"$f":"IF(Lots!A43=\"\",\"\",Lots!EN43)","v":""},{"$f":"IF(Lots!A43=\"\",\"\",Lots!EO43)","v":""},{"$f":"IF(Lots!A43=\"\",\"\",Lots!EP43)","v":""},{"$f":"IF(Lots!A43=\"\",\"\",Lots!EQ43)","v":""},{"$f":"IF(Lots!A43=\"\",\"\",Lots!ER43)","v":""},{"$f":"IF(Lots!A43=\"\",\"\",IF(Lots!ES43=TRUE,\"B\",\"S\"))","v":""}]
[{"$f":"IF(Lots!A44=\"\",\"\",Lots!A44)","v":""},{"$f":"IF(Lots!A44=\"\",\"\",Lots!F44)","v":""},{"$f":"IF(Lots!A44=\"\",\"\",Lots!J44)","v":""},{"$f":"IF(Lots!A44=\"\",\"\",Lots!G44)","v":""},{"$f":"IF(Lots!A44=\"\",\"\",Lots!H44)","v":""},{"$f":"IF(Lots!A44=\"\",\"\",Lots!EA44)","v":""},{"$f":"IF(Lots!A44=\"\",\"\",Lots!EB44)","v":""},{"$f":"IF(Lots!A44=\"\",\"\",Lots!EK44)","v":""},{"$f":"IF(Lots!A44=\"\",\"\",Lots!EF44)","v":""},{"$f":"IF(Lots!F44=\"\",\"\",Lots!EG44)","v":""},{"$f":"IF(Lots!H44=\"\",\"\",Lots!EH44)","v":""},"",{"$f":"IF(A55=\"\",\"\",IF(Lots!ET44=TRUE,\"D\",\"S\"))","v":""},0,0,0,{"$f":"IF(Lots!A44=\"\",\"\",Lots!EM44)","v":""},{"$f":"IF(Lots!A44=\"\",\"\",Lots!EN44)","v":""},{"$f":"IF(Lots!A44=\"\",\"\",Lots!EO44)","v":""},{"$f":"IF(Lots!A44=\"\",\"\",Lots!EP44)","v":""},{"$f":"IF(Lots!A44=\"\",\"\",Lots!EQ44)","v":""},{"$f":"IF(Lots!A44=\"\",\"\",Lots!ER44)","v":""},{"$f":"IF(Lots!A44=\"\",\"\",IF(Lots!ES44=TRUE,\"B\",\"S\"))","v":""}]
[{"$f":"IF(Lots!A45=\"\",\"\",Lots!A45)","v":""},{"$f":"IF(Lots!A45=\"\",\"\",Lots!F45)","v":""},{"$f":"IF(Lots!A45=\"\",\"\",Lots!J45)","v":""},{"$f":"IF(Lots!A45=\"\",\"\",Lots!G45)","v":""},{"$f":"IF(Lots!A45=\"\",\"\",Lots!H45)","v":""},{"$f":"IF(Lots!A45=\"\",\"\",Lots!EA45)","v":""},{"$f":"IF(Lots!A45=\"\",\"\",Lots!EB45)","v":""},{"$f":"IF(Lots!A45=\"\",\"\",Lots!EK45)","v":""},{"$f":"IF(Lots!A45=\"\",\"\",Lots!EF45)","v":""},{"$f":"IF(Lots!F45=\"\",\"\",Lots!EG45)","v":""},{"$f":"IF(Lots!H45=\"\",\"\",Lots!EH45)","v":""},"",{"$f":"IF(A56=\"\",\"\",IF(Lots!ET45=TRUE,\"D\",\"S\"))","v":""},0,0,0,{"$f":"IF(Lots!A45=\"\",\"\",Lots!EM45)","v":""},{"$f":"IF(Lots!A45=\"\",\"\",Lots!EN45)","v":""},{"$f":"IF(Lots!A45=\"\",\"\",Lots!EO45)","v":""},{"$f":"IF(Lots!A45=\"\",\"\",Lots!EP45)","v":""},{"$f":"IF(Lots!A45=\"\",\"\",Lots!EQ45)","v":""},{"$f":"IF(Lots!A45=\"\",\"\",Lots!ER45)","v":""},{"$f":"IF(Lots!A45=\"\",\"\",IF(Lots!ES45=TRUE,\"B\",\"S\"))","v":""}]
[{"$f":"IF(Lots!A46=\"\",\"\",Lots!A46)","v":""},{"$f":"IF(Lots!A46=\"\",\"\",Lots!F46)","v":""},{"$f":"IF(Lots!A46=\"\",\"\",Lots!J46)","v":""},{"$f":"IF(Lots!A46=\"\",\"\",Lots!G46)","v":""},{"$f":"IF(Lots!A46=\"\",\"\",Lots!H46)","v":""},{"$f":"IF(Lots!A46=\"\",\"\",Lots!EA46)","v":""},{"$f":"IF(Lots!A46=\"\",\"\",Lots!EB46)","v":""},{"$f":"IF(Lots!A46=\"\",\"\",Lots!EK46)","v":""},{"$f":"IF(Lots!A46=\"\",\"\",Lots!EF46)","v":""},{"$f":"IF(Lots!F46=\"\",\"\",Lots!EG46)","v":""},{"$f":"IF(Lots!H46=\"\",\"\",Lots!EH46)","v":""},"",{"$f":"IF(A57=\"\",\"\",IF(Lots!ET46=TRUE,\"D\",\"S\"))","v":""},0,0,0,{"$f":"IF(Lots!A46=\"\",\"\",Lots!EM46)","v":""},{"$f":"IF(Lots!A46=\"\",\"\",Lots!EN46)","v":""},{"$f":"IF(Lots!A46=\"\",\"\",Lots!EO46)","v":""},{"$f":"IF(Lots!A46=\"\",\"\",Lots!EP46)","v":""},{"$f":"IF(Lots!A46=\"\",\"\",Lots!EQ46)","v":""},{"$f":"IF(Lots!A46=\"\",\"\",Lots!ER46)","v":""},{"$f":"IF(Lots!A46=\"\",\"\",IF(Lots!ES46=TRUE,\"B\",\"S\"))","v":""}]
[{"$f":"IF(Lots!A47=\"\",\"\",Lots!A47)","v":""},{"$f":"IF(Lots!A47=\"\",\"\",Lots!F47)","v":""},{"$f":"IF(Lots!A47=\"\",\"\",Lots!J47)","v":""},{"$f":"IF(Lots!A47=\"\",\"\",Lots!G47)","v":""},{"$f":"IF(Lots!A47=\"\",\"\",Lots!H47)","v":""},{"$f":"IF(Lots!A47=\"\",\"\",Lots!EA47)","v":""},{"$f":"IF(Lots!A47=\"\",\"\",Lots!EB47)","v":""},{"$f":"IF(Lots!A47=\"\",\"\",Lots!EK47)","v":""},{"$f":"IF(Lots!A47=\"\",\"\",Lots!EF47)","v":""},{"$f":"IF(Lots!F47=\"\",\"\",Lots!EG47)","v":""},{"$f":"IF(Lots!H47=\"\",\"\",Lots!EH47)","v":""},"",{"$f":"IF(A58=\"\",\"\",IF(Lots!ET47=TRUE,\"D\",\"S\"))","v":""},0,0,0,{"$f":"IF(Lots!A47=\"\",\"\",Lots!EM47)","v":""},{"$f":"IF(Lots!A47=\"\",\"\",Lots!EN47)","v":""},{"$f":"IF(Lots!A47=\"\",\"\",Lots!EO47)","v":""},{"$f":"IF(Lots!A47=\"\",\"\",Lots!EP47)","v":""},{"$f":"IF(Lots!A47=\"\",\"\",Lots!EQ47)","v":""},{"$f":"IF(Lots!A47=\"\",\"\",Lots!ER47)","v":""},{"$f":"IF(Lots!A47=\"\",\"\",IF(Lots!ES47=TRUE,\"B\",\"S\"))","v":""}]
[{"$f":"IF(Lots!A48=\"\",\"\",Lots!A48)","v":""},{"$f":"IF(Lots!A48=\"\",\"\",Lots!F48)","v":""},{"$f":"IF(Lots!A48=\"\",\"\",Lots!J48)","v":""},{"$f":"IF(Lots!A48=\"\",\"\",Lots!G48)","v":""},{"$f":"IF(Lots!A48=\"\",\"\",Lots!H48)","v":""},{"$f":"IF(Lots!A48=\"\",\"\",Lots!EA48)","v":""},{"$f":"IF(Lots!A48=\"\",\"\",Lots!EB48)","v":""},{"$f":"IF(Lots!A48=\"\",\"\",Lots!EK48)","v":""},{"$f":"IF(Lots!A48=\"\",\"\",Lots!EF48)","v":""},{"$f":"IF(Lots!F48=\"\",\"\",Lots!EG48)","v":""},{"$f":"IF(Lots!H48=\"\",\"\",Lots!EH48)","v":""},"",{"$f":"IF(A59=\"\",\"\",IF(Lots!ET48=TRUE,\"D\",\"S\"))","v":""},0,0,0,{"$f":"IF(Lots!A48=\"\",\"\",Lots!EM48)","v":""},{"$f":"IF(Lots!A48=\"\",\"\",Lots!EN48)","v":""},{"$f":"IF(Lots!A48=\"\",\"\",Lots!EO48)","v":""},{"$f":"IF(Lots!A48=\"\",\"\",Lots!EP48)","v":""},{"$f":"IF(Lots!A48=\"\",\"\",Lots!EQ48)","v":""},{"$f":"IF(Lots!A48=\"\",\"\",Lots!ER48)","v":""},{"$f":"IF(Lots!A48=\"\",\"\",IF(Lots!ES48=TRUE,\"B\",\"S\"))","v":""}]
[{"$f":"IF(Lots!A49=\"\",\"\",Lots!A49)","v":""},{"$f":"IF(Lots!A49=\"\",\"\",Lots!F49)","v":""},{"$f":"IF(Lots!A49=\"\",\"\",Lots!J49)","v":""},{"$f":"IF(Lots!A49=\"\",\"\",Lots!G49)","v":""},{"$f":"IF(Lots!A49=\"\",\"\",Lots!H49)","v":""},{"$f":"IF(Lots!A49=\"\",\"\",Lots!EA49)","v":""},{"$f":"IF(Lots!A49=\"\",\"\",Lots!EB49)","v":""},{"$f":"IF(Lots!A49=\"\",\"\",Lots!EK49)","v":""},{"$f":"IF(Lots!A49=\"\",\"\",Lots!EF49)","v":""},{"$f":"IF(Lots!F49=\"\",\"\",Lots!EG49)","v":""},{"$f":"IF(Lots!H49=\"\",\"\",Lots!EH49)","v":""},"",{"$f":"IF(A60=\"\",\"\",IF(Lots!ET49=TRUE,\"D\",\"S\"))","v":""},0,0,0,{"$f":"IF(Lots!A49=\"\",\"\",Lots!EM49)","v":""},{"$f":"IF(Lots!A49=\"\",\"\",Lots!EN49)","v":""},{"$f":"IF(Lots!A49=\"\",\"\",Lots!EO49)","v":""},{"$f":"IF(Lots!A49=\"\",\"\",Lots!EP49)","v":""},{"$f":"IF(Lots!A49=\"\",\"\",Lots!EQ49)","v":""},{"$f":"IF(Lots!A49=\"\",\"\",Lots!ER49)","v":""},{"$f":"IF(Lots!A49=\"\",\"\",IF(Lots!ES49=TRUE,\"B\",\"S\"))","v":""}]
[{"$f":"IF(Lots!A50=\"\",\"\",Lots!A50)","v":""},{"$f":"IF(Lots!A50=\"\",\"\",Lots!F50)","v":""},{"$f":"IF(Lots!A50=\"\",\"\",Lots!J50)","v":""},{"$f":"IF(Lots!A50=\"\",\"\",Lots!G50)","v":""},{"$f":"IF(Lots!A50=\"\",\"\",Lots!H50)","v":""},{"$f":"IF(Lots!A50=\"\",\"\",Lots!EA50)","v":""},{"$f":"IF(Lots!A50=\"\",\"\",Lots!EB50)","v":""},{"$f":"IF(Lots!A50=\"\",\"\",Lots!EK50)","v":""},{"$f":"IF(Lots!A50=\"\",\"\",Lots!EF50)","v":""},{"$f":"IF(Lots!F50=\"\",\"\",Lots!EG50)","v":""},{"$f":"IF(Lots!H50=\"\",\"\",Lots!EH50)","v":""},"",{"$f":"IF(A61=\"\",\"\",IF(Lots!ET50=TRUE,\"D\",\"S\"))","v":""},0,0,0,{"$f":"IF(Lots!A50=\"\",\"\",Lots!EM50)","v":""},{"$f":"IF(Lots!A50=\"\",\"\",Lots!EN50)","v":""},{"$f":"IF(Lots!A50=\"\",\"\",Lots!EO50)","v":""},{"$f":"IF(Lots!A50=\"\",\"\",Lots!EP50)","v":""},{"$f":"IF(Lots!A50=\"\",\"\",Lots!EQ50)","v":""},{"$f":"IF(Lots!A50=\"\",\"\",Lots!ER50)","v":""},{"$f":"IF(Lots!A50=\"\",\"\",IF(Lots!ES50=TRUE,\"B\",\"S\"))","v":""}]
[{"$f":"IF(Lots!A51=\"\",\"\",Lots!A51)","v":""},{"$f":"IF(Lots!A51=\"\",\"\",Lots!F51)","v":""},{"$f":"IF(Lots!A51=\"\",\"\",Lots!J51)","v":""},{"$f":"IF(Lots!A51=\"\",\"\",Lots!G51)","v":""},{"$f":"IF(Lots!A51=\"\",\"\",Lots!H51)","v":""},{"$f":"IF(Lots!A51=\"\",\"\",Lots!EA51)","v":""},{"$f":"IF(Lots!A51=\"\",\"\",Lots!EB51)","v":""},{"$f":"IF(Lots!A51=\"\",\"\",Lots!EK51)","v":""},{"$f":"IF(Lots!A51=\"\",\"\",Lots!EF51)","v":""},{"$f":"IF(Lots!F51=\"\",\"\",Lots!EG51)","v":""},{"$f":"IF(Lots!H51=\"\",\"\",Lots!EH51)","v":""},"",{"$f":"IF(A62=\"\",\"\",IF(Lots!ET51=TRUE,\"D\",\"S\"))","v":""},0,0,0,{"$f":"IF(Lots!A51=\"\",\"\",Lots!EM51)","v":""},{"$f":"IF(Lots!A51=\"\",\"\",Lots!EN51)","v":""},{"$f":"IF(Lots!A51=\"\",\"\",Lots!EO51)","v":""},{"$f":"IF(Lots!A51=\"\",\"\",Lots!EP51)","v":""},{"$f":"IF(Lots!A51=\"\",\"\",Lots!EQ51)","v":""},{"$f":"IF(Lots!A51=\"\",\"\",Lots!ER51)","v":""},{"$f":"IF(Lots!A51=\"\",\"\",IF(Lots!ES51=TRUE,\"B\",\"S\"))","v":""}]
[{"$f":"IF(Lots!A52=\"\",\"\",Lots!A52)","v":""},{"$f":"IF(Lots!A52=\"\",\"\",Lots!F52)","v":""},{"$f":"IF(Lots!A52=\"\",\"\",Lots!J52)","v":""},{"$f":"IF(Lots!A52=\"\",\"\",Lots!G52)","v":""},{"$f":"IF(Lots!A52=\"\",\"\",Lots!H52)","v":""},{"$f":"IF(Lots!A52=\"\",\"\",Lots!EA52)","v":""},{"$f":"IF(Lots!A52=\"\",\"\",Lots!EB52)","v":""},{"$f":"IF(Lots!A52=\"\",\"\",Lots!EK52)","v":""},{"$f":"IF(Lots!A52=\"\",\"\",Lots!EF52)","v":""},{"$f":"IF(Lots!F52=\"\",\"\",Lots!EG52)","v":""},{"$f":"IF(Lots!H52=\"\",\"\",Lots!EH52)","v":""},"",{"$f":"IF(A63=\"\",\"\",IF(Lots!ET52=TRUE,\"D\",\"S\"))","v":""},0,0,0,{"$f":"IF(Lots!A52=\"\",\"\",Lots!EM52)","v":""},{"$f":"IF(Lots!A52=\"\",\"\",Lots!EN52)","v":""},{"$f":"IF(Lots!A52=\"\",\"\",Lots!EO52)","v":""},{"$f":"IF(Lots!A52=\"\",\"\",Lots!EP52)","v":""},{"$f":"IF(Lots!A52=\"\",\"\",Lots!EQ52)","v":""},{"$f":"IF(Lots!A52=\"\",\"\",Lots!ER52)","v":""},{"$f":"IF(Lots!A52=\"\",\"\",IF(Lots!ES52=TRUE,\"B\",\"S\"))","v":""}]
[{"$f":"IF(Lots!A53=\"\",\"\",Lots!A53)","v":""},{"$f":"IF(Lots!A53=\"\",\"\",Lots!F53)","v":""},{"$f":"IF(Lots!A53=\"\",\"\",Lots!J53)","v":""},{"$f":"IF(Lots!A53=\"\",\"\",Lots!G53)","v":""},{"$f":"IF(Lots!A53=\"\",\"\",Lots!H53)","v":""},{"$f":"IF(Lots!A53=\"\",\"\",Lots!EA53)","v":""},{"$f":"IF(Lots!A53=\"\",\"\",Lots!EB53)","v":""},{"$f":"IF(Lots!A53=\"\",\"\",Lots!EK53)","v":""},{"$f":"IF(Lots!A53=\"\",\"\",Lots!EF53)","v":""},{"$f":"IF(Lots!F53=\"\",\"\",Lots!EG53)","v":""},{"$f":"IF(Lots!H53=\"\",\"\",Lots!EH53)","v":""},"",{"$f":"IF(A64=\"\",\"\",IF(Lots!ET53=TRUE,\"D\",\"S\"))","v":""},0,0,0,{"$f":"IF(Lots!A53=\"\",\"\",Lots!EM53)","v":""},{"$f":"IF(Lots!A53=\"\",\"\",Lots!EN53)","v":""},{"$f":"IF(Lots!A53=\"\",\"\",Lots!EO53)","v":""},{"$f":"IF(Lots!A53=\"\",\"\",Lots!EP53)","v":""},{"$f":"IF(Lots!A53=\"\",\"\",Lots!EQ53)","v":""},{"$f":"IF(Lots!A53=\"\",\"\",Lots!ER53)","v":""},{"$f":"IF(Lots!A53=\"\",\"\",IF(Lots!ES53=TRUE,\"B\",\"S\"))","v":""}]
[{"$f":"IF(Lots!A54=\"\",\"\",Lots!A54)","v":""},{"$f":"IF(Lots!A54=\"\",\"\",Lots!F54)","v":""},{"$f":"IF(Lots!A54=\"\",\"\",Lots!J54)","v":""},{"$f":"IF(Lots!A54=\"\",\"\",Lots!G54)","v":""},{"$f":"IF(Lots!A54=\"\",\"\",Lots!H54)","v":""},{"$f":"IF(Lots!A54=\"\",\"\",Lots!EA54)","v":""},{"$f":"IF(Lots!A54=\"\",\"\",Lots!EB54)","v":""},{"$f":"IF(Lots!A54=\"\",\"\",Lots!EK54)","v":""},{"$f":"IF(Lots!A54=\"\",\"\",Lots!EF54)","v":""},{"$f":"IF(Lots!F54=\"\",\"\",Lots!EG54)","v":""},{"$f":"IF(Lots!H54=\"\",\"\",Lots!EH54)","v":""},"",{"$f":"IF(A65=\"\",\"\",IF(Lots!ET54=TRUE,\"D\",\"S\"))","v":""},0,0,0,{"$f":"IF(Lots!A54=\"\",\"\",Lots!EM54)","v":""},{"$f":"IF(Lots!A54=\"\",\"\",Lots!EN54)","v":""},{"$f":"IF(Lots!A54=\"\",\"\",Lots!EO54)","v":""},{"$f":"IF(Lots!A54=\"\",\"\",Lots!EP54)","v":""},{"$f":"IF(Lots!A54=\"\",\"\",Lots!EQ54)","v":""},{"$f":"IF(Lots!A54=\"\",\"\",Lots!ER54)","v":""},{"$f":"IF(Lots!A54=\"\",\"\",IF(Lots!ES54=TRUE,\"B\",\"S\"))","v":""}]
[{"$f":"IF(Lots!A55=\"\",\"\",Lots!A55)","v":""},{"$f":"IF(Lots!A55=\"\",\"\",Lots!F55)","v":""},{"$f":"IF(Lots!A55=\"\",\"\",Lots!J55)","v":""},{"$f":"IF(Lots!A55=\"\",\"\",Lots!G55)","v":""},{"$f":"IF(Lots!A55=\"\",\"\",Lots!H55)","v":""},{"$f":"IF(Lots!A55=\"\",\"\",Lots!EA55)","v":""},{"$f":"IF(Lots!A55=\"\",\"\",Lots!EB55)","v":""},{"$f":"IF(Lots!A55=\"\",\"\",Lots!EK55)","v":""},{"$f":"IF(Lots!A55=\"\",\"\",Lots!EF55)","v":""},{"$f":"IF(Lots!F55=\"\",\"\",Lots!EG55)","v":""},{"$f":"IF(Lots!H55=\"\",\"\",Lots!EH55)","v":""},"",{"$f":"IF(A66=\"\",\"\",IF(Lots!ET55=TRUE,\"D\",\"S\"))","v":""},0,0,0,{"$f":"IF(Lots!A55=\"\",\"\",Lots!EM55)","v":""},{"$f":"IF(Lots!A55=\"\",\"\",Lots!EN55)","v":""},{"$f":"IF(Lots!A55=\"\",\"\",Lots!EO55)","v":""},{"$f":"IF(Lots!A55=\"\",\"\",Lots!EP55)","v":""},{"$f":"IF(Lots!A55=\"\",\"\",Lots!EQ55)","v":""},{"$f":"IF(Lots!A55=\"\",\"\",Lots!ER55)","v":""},{"$f":"IF(Lots!A55=\"\",\"\",IF(Lots!ES55=TRUE,\"B\",\"S\"))","v":""}]
[{"$f":"IF(Lots!A56=\"\",\"\",Lots!A56)","v":""},{"$f":"IF(Lots!A56=\"\",\"\",Lots!F56)","v":""},{"$f":"IF(Lots!A56=\"\",\"\",Lots!J56)","v":""},{"$f":"IF(Lots!A56=\"\",\"\",Lots!G56)","v":""},{"$f":"IF(Lots!A56=\"\",\"\",Lots!H56)","v":""},{"$f":"IF(Lots!A56=\"\",\"\",Lots!EA56)","v":""},{"$f":"IF(Lots!A56=\"\",\"\",Lots!EB56)","v":""},{"$f":"IF(Lots!A56=\"\",\"\",Lots!EK56)","v":""},{"$f":"IF(Lots!A56=\"\",\"\",Lots!EF56)","v":""},{"$f":"IF(Lots!F56=\"\",\"\",Lots!EG56)","v":""},{"$f":"IF(Lots!H56=\"\",\"\",Lots!EH56)","v":""},"",{"$f":"IF(A67=\"\",\"\",IF(Lots!ET56=TRUE,\"D\",\"S\"))","v":""},0,0,0,{"$f":"IF(Lots!A56=\"\",\"\",Lots!EM56)","v":""},{"$f":"IF(Lots!A56=\"\",\"\",Lots!EN56)","v":""},{"$f":"IF(Lots!A56=\"\",\"\",Lots!EO56)","v":""},{"$f":"IF(Lots!A56=\"\",\"\",Lots!EP56)","v":""},{"$f":"IF(Lots!A56=\"\",\"\",Lots!EQ56)","v":""},{"$f":"IF(Lots!A56=\"\",\"\",Lots!ER56)","v":""},{"$f":"IF(Lots!A56=\"\",\"\",IF(Lots!ES56=TRUE,\"B\",\"S\"))","v":""}]
[{"$f":"IF(Lots!A57=\"\",\"\",Lots!A57)","v":""},{"$f":"IF(Lots!A57=\"\",\"\",Lots!F57)","v":""},{"$f":"IF(Lots!A57=\"\",\"\",Lots!J57)","v":""},{"$f":"IF(Lots!A57=\"\",\"\",Lots!G57)","v":""},{"$f":"IF(Lots!A57=\"\",\"\",Lots!H57)","v":""},{"$f":"IF(Lots!A57=\"\",\"\",Lots!EA57)","v":""},{"$f":"IF(Lots!A57=\"\",\"\",Lots!EB57)","v":""},{"$f":"IF(Lots!A57=\"\",\"\",Lots!EK57)","v":""},{"$f":"IF(Lots!A57=\"\",\"\",Lots!EF57)","v":""},{"$f":"IF(Lots!F57=\"\",\"\",Lots!EG57)","v":""},{"$f":"IF(Lots!H57=\"\",\"\",Lots!EH57)","v":""},"",{"$f":"IF(A68=\"\",\"\",IF(Lots!ET57=TRUE,\"D\",\"S\"))","v":""},0,0,0,{"$f":"IF(Lots!A57=\"\",\"\",Lots!EM57)","v":""},{"$f":"IF(Lots!A57=\"\",\"\",Lots!EN57)","v":""},{"$f":"IF(Lots!A57=\"\",\"\",Lots!EO57)","v":""},{"$f":"IF(Lots!A57=\"\",\"\",Lots!EP57)","v":""},{"$f":"IF(Lots!A57=\"\",\"\",Lots!EQ57)","v":""},{"$f":"IF(Lots!A57=\"\",\"\",Lots!ER57)","v":""},{"$f":"IF(Lots!A57=\"\",\"\",IF(Lots!ES57=TRUE,\"B\",\"S\"))","v":""}]
[{"$f":"IF(Lots!A58=\"\",\"\",Lots!A58)","v":""},{"$f":"IF(Lots!A58=\"\",\"\",Lots!F58)","v":""},{"$f":"IF(Lots!A58=\"\",\"\",Lots!J58)","v":""},{"$f":"IF(Lots!A58=\"\",\"\",Lots!G58)","v":""},{"$f":"IF(Lots!A58=\"\",\"\",Lots!H58)","v":""},{"$f":"IF(Lots!A58=\"\",\"\",Lots!EA58)","v":""},{"$f":"IF(Lots!A58=\"\",\"\",Lots!EB58)","v":""},{"$f":"IF(Lots!A58=\"\",\"\",Lots!EK58)","v":""},{"$f":"IF(Lots!A58=\"\",\"\",Lots!EF58)","v":""},{"$f":"IF(Lots!F58=\"\",\"\",Lots!EG58)","v":""},{"$f":"IF(Lots!H58=\"\",\"\",Lots!EH58)","v":""},"",{"$f":"IF(A69=\"\",\"\",IF(Lots!ET58=TRUE,\"D\",\"S\"))","v":""},0,0,0,{"$f":"IF(Lots!A58=\"\",\"\",Lots!EM58)","v":""},{"$f":"IF(Lots!A58=\"\",\"\",Lots!EN58)","v":""},{"$f":"IF(Lots!A58=\"\",\"\",Lots!EO58)","v":""},{"$f":"IF(Lots!A58=\"\",\"\",Lots!EP58)","v":""},{"$f":"IF(Lots!A58=\"\",\"\",Lots!EQ58)","v":""},{"$f":"IF(Lots!A58=\"\",\"\",Lots!ER58)","v":""},{"$f":"IF(Lots!A58=\"\",\"\",IF(Lots!ES58=TRUE,\"B\",\"S\"))","v":""}]
[{"$f":"IF(Lots!A59=\"\",\"\",Lots!A59)","v":""},{"$f":"IF(Lots!A59=\"\",\"\",Lots!F59)","v":""},{"$f":"IF(Lots!A59=\"\",\"\",Lots!J59)","v":""},{"$f":"IF(Lots!A59=\"\",\"\",Lots!G59)","v":""},{"$f":"IF(Lots!A59=\"\",\"\",Lots!H59)","v":""},{"$f":"IF(Lots!A59=\"\",\"\",Lots!EA59)","v":""},{"$f":"IF(Lots!A59=\"\",\"\",Lots!EB59)","v":""},{"$f":"IF(Lots!A59=\"\",\"\",Lots!EK59)","v":""},{"$f":"IF(Lots!A59=\"\",\"\",Lots!EF59)","v":""},{"$f":"IF(Lots!F59=\"\",\"\",Lots!EG59)","v":""},{"$f":"IF(Lots!H59=\"\",\"\",Lots!EH59)","v":""},"",{"$f":"IF(A70=\"\",\"\",IF(Lots!ET59=TRUE,\"D\",\"S\"))","v":""},0,0,0,{"$f":"IF(Lots!A59=\"\",\"\",Lots!EM59)","v":""},{"$f":"IF(Lots!A59=\"\",\"\",Lots!EN59)","v":""},{"$f":"IF(Lots!A59=\"\",\"\",Lots!EO59)","v":""},{"$f":"IF(Lots!A59=\"\",\"\",Lots!EP59)","v":""},{"$f":"IF(Lots!A59=\"\",\"\",Lots!EQ59)","v":""},{"$f":"IF(Lots!A59=\"\",\"\",Lots!ER59)","v":""},{"$f":"IF(Lots!A59=\"\",\"\",IF(Lots!ES59=TRUE,\"B\",\"S\"))","v":""}]
[{"$f":"IF(Lots!A60=\"\",\"\",Lots!A60)","v":""},{"$f":"IF(Lots!A60=\"\",\"\",Lots!F60)","v":""},{"$f":"IF(Lots!A60=\"\",\"\",Lots!J60)","v":""},{"$f":"IF(Lots!A60=\"\",\"\",Lots!G60)","v":""},{"$f":"IF(Lots!A60=\"\",\"\",Lots!H60)","v":""},{"$f":"IF(Lots!A60=\"\",\"\",Lots!EA60)","v":""},{"$f":"IF(Lots!A60=\"\",\"\",Lots!EB60)","v":""},{"$f":"IF(Lots!A60=\"\",\"\",Lots!EK60)","v":""},{"$f":"IF(Lots!A60=\"\",\"\",Lots!EF60)","v":""},{"$f":"IF(Lots!F60=\"\",\"\",Lots!EG60)","v":""},{"$f":"IF(Lots!H60=\"\",\"\",Lots!EH60)","v":""},"",{"$f":"IF(A71=\"\",\"\",IF(Lots!ET60=TRUE,\"D\",\"S\"))","v":""},0,0,0,{"$f":"IF(Lots!A60=\"\",\"\",Lots!EM60)","v":""},{"$f":"IF(Lots!A60=\"\",\"\",Lots!EN60)","v":""},{"$f":"IF(Lots!A60=\"\",\"\",Lots!EO60)","v":""},{"$f":"IF(Lots!A60=\"\",\"\",Lots!EP60)","v":""},{"$f":"IF(Lots!A60=\"\",\"\",Lots!EQ60)","v":""},{"$f":"IF(Lots!A60=\"\",\"\",Lots!ER60)","v":""},{"$f":"IF(Lots!A60=\"\",\"\",IF(Lots!ES60=TRUE,\"B\",\"S\"))","v":""}]
[{"$f":"IF(Lots!A61=\"\",\"\",Lots!A61)","v":""},{"$f":"IF(Lots!A61=\"\",\"\",Lots!F61)","v":""},{"$f":"IF(Lots!A61=\"\",\"\",Lots!J61)","v":""},{"$f":"IF(Lots!A61=\"\",\"\",Lots!G61)","v":""},{"$f":"IF(Lots!A61=\"\",\"\",Lots!H61)","v":""},{"$f":"IF(Lots!A61=\"\",\"\",Lots!EA61)","v":""},{"$f":"IF(Lots!A61=\"\",\"\",Lots!EB61)","v":""},{"$f":"IF(Lots!A61=\"\",\"\",Lots!EK61)","v":""},{"$f":"IF(Lots!A61=\"\",\"\",Lots!EF61)","v":""},{"$f":"IF(Lots!F61=\"\",\"\",Lots!EG61)","v":""},{"$f":"IF(Lots!H61=\"\",\"\",Lots!EH61)","v":""},"",{"$f":"IF(A72=\"\",\"\",IF(Lots!ET61=TRUE,\"D\",\"S\"))","v":""},0,0,0,{"$f":"IF(Lots!A61=\"\",\"\",Lots!EM61)","v":""},{"$f":"IF(Lots!A61=\"\",\"\",Lots!EN61)","v":""},{"$f":"IF(Lots!A61=\"\",\"\",Lots!EO61)","v":""},{"$f":"IF(Lots!A61=\"\",\"\",Lots!EP61)","v":""},{"$f":"IF(Lots!A61=\"\",\"\",Lots!EQ61)","v":""},{"$f":"IF(Lots!A61=\"\",\"\",Lots!ER61)","v":""},{"$f":"IF(Lots!A61=\"\",\"\",IF(Lots!ES61=TRUE,\"B\",\"S\"))","v":""}]
[{"$f":"IF(Lots!A62=\"\",\"\",Lots!A62)","v":""},{"$f":"IF(Lots!A62=\"\",\"\",Lots!F62)","v":""},{"$f":"IF(Lots!A62=\"\",\"\",Lots!J62)","v":""},{"$f":"IF(Lots!A62=\"\",\"\",Lots!G62)","v":""},{"$f":"IF(Lots!A62=\"\",\"\",Lots!H62)","v":""},{"$f":"IF(Lots!A62=\"\",\"\",Lots!EA62)","v":""},{"$f":"IF(Lots!A62=\"\",\"\",Lots!EB62)","v":""},{"$f":"IF(Lots!A62=\"\",\"\",Lots!EK62)","v":""},{"$f":"IF(Lots!A62=\"\",\"\",Lots!EF62)","v":""},{"$f":"IF(Lots!F62=\"\",\"\",Lots!EG62)","v":""},{"$f":"IF(Lots!H62=\"\",\"\",Lots!EH62)","v":""},"",{"$f":"IF(A73=\"\",\"\",IF(Lots!ET62=TRUE,\"D\",\"S\"))","v":""},0,0,0,{"$f":"IF(Lots!A62=\"\",\"\",Lots!EM62)","v":""},{"$f":"IF(Lots!A62=\"\",\"\",Lots!EN62)","v":""},{"$f":"IF(Lots!A62=\"\",\"\",Lots!EO62)","v":""},{"$f":"IF(Lots!A62=\"\",\"\",Lots!EP62)","v":""},{"$f":"IF(Lots!A62=\"\",\"\",Lots!EQ62)","v":""},{"$f":"IF(Lots!A62=\"\",\"\",Lots!ER62)","v":""},{"$f":"IF(Lots!A62=\"\",\"\",IF(Lots!ES62=TRUE,\"B\",\"S\"))","v":""}]
[{"$f":"IF(Lots!A63=\"\",\"\",Lots!A63)","v":""},{"$f":"IF(Lots!A63=\"\",\"\",Lots!F63)","v":""},{"$f":"IF(Lots!A63=\"\",\"\",Lots!J63)","v":""},{"$f":"IF(Lots!A63=\"\",\"\",Lots!G63)","v":""},{"$f":"IF(Lots!A63=\"\",\"\",Lots!H63)","v":""},{"$f":"IF(Lots!A63=\"\",\"\",Lots!EA63)","v":""},{"$f":"IF(Lots!A63=\"\",\"\",Lots!EB63)","v":""},{"$f":"IF(Lots!A63=\"\",\"\",Lots!EK63)","v":""},{"$f":"IF(Lots!A63=\"\",\"\",Lots!EF63)","v":""},{"$f":"IF(Lots!F63=\"\",\"\",Lots!EG63)","v":""},{"$f":"IF(Lots!H63=\"\",\"\",Lots!EH63)","v":""},"",{"$f":"IF(A74=\"\",\"\",IF(Lots!ET63=TRUE,\"D\",\"S\"))","v":""},0,0,0,{"$f":"IF(Lots!A63=\"\",\"\",Lots!EM63)","v":""},{"$f":"IF(Lots!A63=\"\",\"\",Lots!EN63)","v":""},{"$f":"IF(Lots!A63=\"\",\"\",Lots!EO63)","v":""},{"$f":"IF(Lots!A63=\"\",\"\",Lots!EP63)","v":""},{"$f":"IF(Lots!A63=\"\",\"\",Lots!EQ63)","v":""},{"$f":"IF(Lots!A63=\"\",\"\",Lots!ER63)","v":""},{"$f":"IF(Lots!A63=\"\",\"\",IF(Lots!ES63=TRUE,\"B\",\"S\"))","v":""}]
[{"$f":"IF(Lots!A64=\"\",\"\",Lots!A64)","v":""},{"$f":"IF(Lots!A64=\"\",\"\",Lots!F64)","v":""},{"$f":"IF(Lots!A64=\"\",\"\",Lots!J64)","v":""},{"$f":"IF(Lots!A64=\"\",\"\",Lots!G64)","v":""},{"$f":"IF(Lots!A64=\"\",\"\",Lots!H64)","v":""},{"$f":"IF(Lots!A64=\"\",\"\",Lots!EA64)","v":""},{"$f":"IF(Lots!A64=\"\",\"\",Lots!EB64)","v":""},{"$f":"IF(Lots!A64=\"\",\"\",Lots!EK64)","v":""},{"$f":"IF(Lots!A64=\"\",\"\",Lots!EF64)","v":""},{"$f":"IF(Lots!F64=\"\",\"\",Lots!EG64)","v":""},{"$f":"IF(Lots!H64=\"\",\"\",Lots!EH64)","v":""},"",{"$f":"IF(A75=\"\",\"\",IF(Lots!ET64=TRUE,\"D\",\"S\"))","v":""},0,0,0,{"$f":"IF(Lots!A64=\"\",\"\",Lots!EM64)","v":""},{"$f":"IF(Lots!A64=\"\",\"\",Lots!EN64)","v":""},{"$f":"IF(Lots!A64=\"\",\"\",Lots!EO64)","v":""},{"$f":"IF(Lots!A64=\"\",\"\",Lots!EP64)","v":""},{"$f":"IF(Lots!A64=\"\",\"\",Lots!EQ64)","v":""},{"$f":"IF(Lots!A64=\"\",\"\",Lots!ER64)","v":""},{"$f":"IF(Lots!A64=\"\",\"\",IF(Lots!ES64=TRUE,\"B\",\"S\"))","v":""}]
[{"$f":"IF(Lots!A65=\"\",\"\",Lots!A65)","v":""},{"$f":"IF(Lots!A65=\"\",\"\",Lots!F65)","v":""},{"$f":"IF(Lots!A65=\"\",\"\",Lots!J65)","v":""},{"$f":"IF(Lots!A65=\"\",\"\",Lots!G65)","v":""},{"$f":"IF(Lots!A65=\"\",\"\",Lots!H65)","v":""},{"$f":"IF(Lots!A65=\"\",\"\",Lots!EA65)","v":""},{"$f":"IF(Lots!A65=\"\",\"\",Lots!EB65)","v":""},{"$f":"IF(Lots!A65=\"\",\"\",Lots!EK65)","v":""},{"$f":"IF(Lots!A65=\"\",\"\",Lots!EF65)","v":""},{"$f":"IF(Lots!F65=\"\",\"\",Lots!EG65)","v":""},{"$f":"IF(Lots!H65=\"\",\"\",Lots!EH65)","v":""},"",{"$f":"IF(A76=\"\",\"\",IF(Lots!ET65=TRUE,\"D\",\"S\"))","v":""},0,0,0,{"$f":"IF(Lots!A65=\"\",\"\",Lots!EM65)","v":""},{"$f":"IF(Lots!A65=\"\",\"\",Lots!EN65)","v":""},{"$f":"IF(Lots!A65=\"\",\"\",Lots!EO65)","v":""},{"$f":"IF(Lots!A65=\"\",\"\",Lots!EP65)","v":""},{"$f":"IF(Lots!A65=\"\",\"\",Lots!EQ65)","v":""},{"$f":"IF(Lots!A65=\"\",\"\",Lots!ER65)","v":""},{"$f":"IF(Lots!A65=\"\",\"\",IF(Lots!ES65=TRUE,\"B\",\"S\"))","v":""}]
[{"$f":"IF(Lots!A66=\"\",\"\",Lots!A66)","v":""},{"$f":"IF(Lots!A66=\"\",\"\",Lots!F66)","v":""},{"$f":"IF(Lots!A66=\"\",\"\",Lots!J66)","v":""},{"$f":"IF(Lots!A66=\"\",\"\",Lots!G66)","v":""},{"$f":"IF(Lots!A66=\"\",\"\",Lots!H66)","v":""},{"$f":"IF(Lots!A66=\"\",\"\",Lots!EA66)","v":""},{"$f":"IF(Lots!A66=\"\",\"\",Lots!EB66)","v":""},{"$f":"IF(Lots!A66=\"\",\"\",Lots!EK66)","v":""},{"$f":"IF(Lots!A66=\"\",\"\",Lots!EF66)","v":""},{"$f":"IF(Lots!F66=\"\",\"\",Lots!EG66)","v":""},{"$f":"IF(Lots!H66=\"\",\"\",Lots!EH66)","v":""},"",{"$f":"IF(A77=\"\",\"\",IF(Lots!ET66=TRUE,\"D\",\"S\"))","v":""},0,0,0,{"$f":"IF(Lots!A66=\"\",\"\",Lots!EM66)","v":""},{"$f":"IF(Lots!A66=\"\",\"\",Lots!EN66)","v":""},{"$f":"IF(Lots!A66=\"\",\"\",Lots!EO66)","v":""},{"$f":"IF(Lots!A66=\"\",\"\",Lots!EP66)","v":""},{"$f":"IF(Lots!A66=\"\",\"\",Lots!EQ66)","v":""},{"$f":"IF(Lots!A66=\"\",\"\",Lots!ER66)","v":""},{"$f":"IF(Lots!A66=\"\",\"\",IF(Lots!ES66=TRUE,\"B\",\"S\"))","v":""}]
[{"$f":"IF(Lots!A67=\"\",\"\",Lots!A67)","v":""},{"$f":"IF(Lots!A67=\"\",\"\",Lots!F67)","v":""},{"$f":"IF(Lots!A67=\"\",\"\",Lots!J67)","v":""},{"$f":"IF(Lots!A67=\"\",\"\",Lots!G67)","v":""},{"$f":"IF(Lots!A67=\"\",\"\",Lots!H67)","v":""},{"$f":"IF(Lots!A67=\"\",\"\",Lots!EA67)","v":""},{"$f":"IF(Lots!A67=\"\",\"\",Lots!EB67)","v":""},{"$f":"IF(Lots!A67=\"\",\"\",Lots!EK67)","v":""},{"$f":"IF(Lots!A67=\"\",\"\",Lots!EF67)","v":""},{"$f":"IF(Lots!F67=\"\",\"\",Lots!EG67)","v":""},{"$f":"IF(Lots!H67=\"\",\"\",Lots!EH67)","v":""},{"$f":"IF(A78=\"\",\"\",SUM(J78:K78))","v":""},{"$f":"IF(A78=\"\",\"\",IF(Lots!ET67=TRUE,\"D\",\"S\"))","v":""},0,0,0,{"$f":"IF(Lots!A67=\"\",\"\",Lots!EM67)","v":""},{"$f":"IF(Lots!A67=\"\",\"\",Lots!EN67)","v":""},{"$f":"IF(Lots!A67=\"\",\"\",Lots!EO67)","v":""},{"$f":"IF(Lots!A67=\"\",\"\",Lots!EP67)","v":""},{"$f":"IF(Lots!A67=\"\",\"\",Lots!EQ67)","v":""},{"$f":"IF(Lots!A67=\"\",\"\",Lots!ER67)","v":""},{"$f":"IF(Lots!A67=\"\",\"\",IF(Lots!ES67=TRUE,\"B\",\"S\"))","v":""}]
[{"$f":"IF(Lots!A68=\"\",\"\",Lots!A68)","v":""},{"$f":"IF(Lots!A68=\"\",\"\",Lots!F68)","v":""},{"$f":"IF(Lots!A68=\"\",\"\",Lots!J68)","v":""},{"$f":"IF(Lots!A68=\"\",\"\",Lots!G68)","v":""},{"$f":"IF(Lots!A68=\"\",\"\",Lots!H68)","v":""},{"$f":"IF(Lots!A68=\"\",\"\",Lots!EA68)","v":""},{"$f":"IF(Lots!A68=\"\",\"\",Lots!EB68)","v":""},{"$f":"IF(Lots!A68=\"\",\"\",Lots!EK68)","v":""},{"$f":"IF(Lots!A68=\"\",\"\",Lots!EF68)","v":""},{"$f":"IF(Lots!F68=\"\",\"\",Lots!EG68)","v":""},{"$f":"IF(Lots!H68=\"\",\"\",Lots!EH68)","v":""},"",{"$f":"IF(A79=\"\",\"\",IF(Lots!ET68=TRUE,\"D\",\"S\"))","v":""},0,0,0,{"$f":"IF(Lots!A68=\"\",\"\",Lots!EM68)","v":""},{"$f":"IF(Lots!A68=\"\",\"\",Lots!EN68)","v":""},{"$f":"IF(Lots!A68=\"\",\"\",Lots!EO68)","v":""},{"$f":"IF(Lots!A68=\"\",\"\",Lots!EP68)","v":""},{"$f":"IF(Lots!A68=\"\",\"\",Lots!EQ68)","v":""},{"$f":"IF(Lots!A68=\"\",\"\",Lots!ER68)","v":""},{"$f":"IF(Lots!A68=\"\",\"\",IF(Lots!ES68=TRUE,\"B\",\"S\"))","v":""}]
[{"$f":"IF(Lots!A69=\"\",\"\",Lots!A69)","v":""},{"$f":"IF(Lots!A69=\"\",\"\",Lots!F69)","v":""},{"$f":"IF(Lots!A69=\"\",\"\",Lots!J69)","v":""},{"$f":"IF(Lots!A69=\"\",\"\",Lots!G69)","v":""},{"$f":"IF(Lots!A69=\"\",\"\",Lots!H69)","v":""},{"$f":"IF(Lots!A69=\"\",\"\",Lots!EA69)","v":""},{"$f":"IF(Lots!A69=\"\",\"\",Lots!EB69)","v":""},{"$f":"IF(Lots!A69=\"\",\"\",Lots!EK69)","v":""},{"$f":"IF(Lots!A69=\"\",\"\",Lots!EF69)","v":""},{"$f":"IF(Lots!F69=\"\",\"\",Lots!EG69)","v":""},{"$f":"IF(Lots!H69=\"\",\"\",Lots!EH69)","v":""},"",{"$f":"IF(A80=\"\",\"\",IF(Lots!ET69=TRUE,\"D\",\"S\"))","v":""},0,0,0,{"$f":"IF(Lots!A69=\"\",\"\",Lots!EM69)","v":""},{"$f":"IF(Lots!A69=\"\",\"\",Lots!EN69)","v":""},{"$f":"IF(Lots!A69=\"\",\"\",Lots!EO69)","v":""},{"$f":"IF(Lots!A69=\"\",\"\",Lots!EP69)","v":""},{"$f":"IF(Lots!A69=\"\",\"\",Lots!EQ69)","v":""},{"$f":"IF(Lots!A69=\"\",\"\",Lots!ER69)","v":""},{"$f":"IF(Lots!A69=\"\",\"\",IF(Lots!ES69=TRUE,\"B\",\"S\"))","v":""}]
[{"$f":"IF(Lots!A70=\"\",\"\",Lots!A70)","v":""},{"$f":"IF(Lots!A70=\"\",\"\",Lots!F70)","v":""},{"$f":"IF(Lots!A70=\"\",\"\",Lots!J70)","v":""},{"$f":"IF(Lots!A70=\"\",\"\",Lots!G70)","v":""},{"$f":"IF(Lots!A70=\"\",\"\",Lots!H70)","v":""},{"$f":"IF(Lots!A70=\"\",\"\",Lots!EA70)","v":""},{"$f":"IF(Lots!A70=\"\",\"\",Lots!EB70)","v":""},{"$f":"IF(Lots!A70=\"\",\"\",Lots!EK70)","v":""},{"$f":"IF(Lots!A70=\"\",\"\",Lots!EF70)","v":""},{"$f":"IF(Lots!F70=\"\",\"\",Lots!EG70)","v":""},{"$f":"IF(Lots!H70=\"\",\"\",Lots!EH70)","v":""},"",{"$f":"IF(A81=\"\",\"\",IF(Lots!ET70=TRUE,\"D\",\"S\"))","v":""},0,0,0,{"$f":"IF(Lots!A70=\"\",\"\",Lots!EM70)","v":""},{"$f":"IF(Lots!A70=\"\",\"\",Lots!EN70)","v":""},{"$f":"IF(Lots!A70=\"\",\"\",Lots!EO70)","v":""},{"$f":"IF(Lots!A70=\"\",\"\",Lots!EP70)","v":""},{"$f":"IF(Lots!A70=\"\",\"\",Lots!EQ70)","v":""},{"$f":"IF(Lots!A70=\"\",\"\",Lots!ER70)","v":""},{"$f":"IF(Lots!A70=\"\",\"\",IF(Lots!ES70=TRUE,\"B\",\"S\"))","v":""}]
[{"$f":"IF(Lots!A71=\"\",\"\",Lots!A71)","v":""},{"$f":"IF(Lots!A71=\"\",\"\",Lots!F71)","v":""},{"$f":"IF(Lots!A71=\"\",\"\",Lots!J71)","v":""},{"$f":"IF(Lots!A71=\"\",\"\",Lots!G71)","v":""},{"$f":"IF(Lots!A71=\"\",\"\",Lots!H71)","v":""},{"$f":"IF(Lots!A71=\"\",\"\",Lots!EA71)","v":""},{"$f":"IF(Lots!A71=\"\",\"\",Lots!EB71)","v":""},{"$f":"IF(Lots!A71=\"\",\"\",Lots!EK71)","v":""},{"$f":"IF(Lots!A71=\"\",\"\",Lots!EF71)","v":""},{"$f":"IF(Lots!F71=\"\",\"\",Lots!EG71)","v":""},{"$f":"IF(Lots!H71=\"\",\"\",Lots!EH71)","v":""},"",{"$f":"IF(A82=\"\",\"\",IF(Lots!ET71=TRUE,\"D\",\"S\"))","v":""},0,0,0,{"$f":"IF(Lots!A71=\"\",\"\",Lots!EM71)","v":""},{"$f":"IF(Lots!A71=\"\",\"\",Lots!EN71)","v":""},{"$f":"IF(Lots!A71=\"\",\"\",Lots!EO71)","v":""},{"$f":"IF(Lots!A71=\"\",\"\",Lots!EP71)","v":""},{"$f":"IF(Lots!A71=\"\",\"\",Lots!EQ71)","v":""},{"$f":"IF(Lots!A71=\"\",\"\",Lots!ER71)","v":""},{"$f":"IF(Lots!A71=\"\",\"\",IF(Lots!ES71=TRUE,\"B\",\"S\"))","v":""}]
[{"$f":"IF(Lots!A72=\"\",\"\",Lots!A72)","v":""},{"$f":"IF(Lots!A72=\"\",\"\",Lots!F72)","v":""},{"$f":"IF(Lots!A72=\"\",\"\",Lots!J72)","v":""},{"$f":"IF(Lots!A72=\"\",\"\",Lots!G72)","v":""},{"$f":"IF(Lots!A72=\"\",\"\",Lots!H72)","v":""},{"$f":"IF(Lots!A72=\"\",\"\",Lots!EA72)","v":""},{"$f":"IF(Lots!A72=\"\",\"\",Lots!EB72)","v":""},{"$f":"IF(Lots!A72=\"\",\"\",Lots!EK72)","v":""},{"$f":"IF(Lots!A72=\"\",\"\",Lots!EF72)","v":""},{"$f":"IF(Lots!F72=\"\",\"\",Lots!EG72)","v":""},{"$f":"IF(Lots!H72=\"\",\"\",Lots!EH72)","v":""},"",{"$f":"IF(A83=\"\",\"\",IF(Lots!ET72=TRUE,\"D\",\"S\"))","v":""},0,0,0,{"$f":"IF(Lots!A72=\"\",\"\",Lots!EM72)","v":""},{"$f":"IF(Lots!A72=\"\",\"\",Lots!EN72)","v":""},{"$f":"IF(Lots!A72=\"\",\"\",Lots!EO72)","v":""},{"$f":"IF(Lots!A72=\"\",\"\",Lots!EP72)","v":""},{"$f":"IF(Lots!A72=\"\",\"\",Lots!EQ72)","v":""},{"$f":"IF(Lots!A72=\"\",\"\",Lots!ER72)","v":""},{"$f":"IF(Lots!A72=\"\",\"\",IF(Lots!ES72=TRUE,\"B\",\"S\"))","v":""}]
[{"$f":"IF(Lots!A73=\"\",\"\",Lots!A73)","v":""},{"$f":"IF(Lots!A73=\"\",\"\",Lots!F73)","v":""},{"$f":"IF(Lots!A73=\"\",\"\",Lots!J73)","v":""},{"$f":"IF(Lots!A73=\"\",\"\",Lots!G73)","v":""},{"$f":"IF(Lots!A73=\"\",\"\",Lots!H73)","v":""},{"$f":"IF(Lots!A73=\"\",\"\",Lots!EA73)","v":""},{"$f":"IF(Lots!A73=\"\",\"\",Lots!EB73)","v":""},{"$f":"IF(Lots!A73=\"\",\"\",Lots!EK73)","v":""},{"$f":"IF(Lots!A73=\"\",\"\",Lots!EF73)","v":""},{"$f":"IF(Lots!F73=\"\",\"\",Lots!EG73)","v":""},{"$f":"IF(Lots!H73=\"\",\"\",Lots!EH73)","v":""},"",{"$f":"IF(A84=\"\",\"\",IF(Lots!ET73=TRUE,\"D\",\"S\"))","v":""},0,0,0,{"$f":"IF(Lots!A73=\"\",\"\",Lots!EM73)","v":""},{"$f":"IF(Lots!A73=\"\",\"\",Lots!EN73)","v":""},{"$f":"IF(Lots!A73=\"\",\"\",Lots!EO73)","v":""},{"$f":"IF(Lots!A73=\"\",\"\",Lots!EP73)","v":""},{"$f":"IF(Lots!A73=\"\",\"\",Lots!EQ73)","v":""},{"$f":"IF(Lots!A73=\"\",\"\",Lots!ER73)","v":""},{"$f":"IF(Lots!A73=\"\",\"\",IF(Lots!ES73=TRUE,\"B\",\"S\"))","v":""}]
[{"$f":"IF(Lots!A74=\"\",\"\",Lots!A74)","v":""},{"$f":"IF(Lots!A74=\"\",\"\",Lots!F74)","v":""},{"$f":"IF(Lots!A74=\"\",\"\",Lots!J74)","v":""},{"$f":"IF(Lots!A74=\"\",\"\",Lots!G74)","v":""},{"$f":"IF(Lots!A74=\"\",\"\",Lots!H74)","v":""},{"$f":"IF(Lots!A74=\"\",\"\",Lots!EA74)","v":""},{"$f":"IF(Lots!A74=\"\",\"\",Lots!EB74)","v":""},{"$f":"IF(Lots!A74=\"\",\"\",Lots!EK74)","v":""},{"$f":"IF(Lots!A74=\"\",\"\",Lots!EF74)","v":""},{"$f":"IF(Lots!F74=\"\",\"\",Lots!EG74)","v":""},{"$f":"IF(Lots!H74=\"\",\"\",Lots!EH74)","v":""},"",{"$f":"IF(A85=\"\",\"\",IF(Lots!ET74=TRUE,\"D\",\"S\"))","v":""},0,0,0,{"$f":"IF(Lots!A74=\"\",\"\",Lots!EM74)","v":""},{"$f":"IF(Lots!A74=\"\",\"\",Lots!EN74)","v":""},{"$f":"IF(Lots!A74=\"\",\"\",Lots!EO74)","v":""},{"$f":"IF(Lots!A74=\"\",\"\",Lots!EP74)","v":""},{"$f":"IF(Lots!A74=\"\",\"\",Lots!EQ74)","v":""},{"$f":"IF(Lots!A74=\"\",\"\",Lots!ER74)","v":""},{"$f":"IF(Lots!A74=\"\",\"\",IF(Lots!ES74=TRUE,\"B\",\"S\"))","v":""}]
[{"$f":"IF(Lots!A75=\"\",\"\",Lots!A75)","v":""},{"$f":"IF(Lots!A75=\"\",\"\",Lots!F75)","v":""},{"$f":"IF(Lots!A75=\"\",\"\",Lots!J75)","v":""},{"$f":"IF(Lots!A75=\"\",\"\",Lots!G75)","v":""},{"$f":"IF(Lots!A75=\"\",\"\",Lots!H75)","v":""},{"$f":"IF(Lots!A75=\"\",\"\",Lots!EA75)","v":""},{"$f":"IF(Lots!A75=\"\",\"\",Lots!EB75)","v":""},{"$f":"IF(Lots!A75=\"\",\"\",Lots!EK75)","v":""},{"$f":"IF(Lots!A75=\"\",\"\",Lots!EF75)","v":""},{"$f":"IF(Lots!F75=\"\",\"\",Lots!EG75)","v":""},{"$f":"IF(Lots!H75=\"\",\"\",Lots!EH75)","v":""},"",{"$f":"IF(A86=\"\",\"\",IF(Lots!ET75=TRUE,\"D\",\"S\"))","v":""},0,0,0,{"$f":"IF(Lots!A75=\"\",\"\",Lots!EM75)","v":""},{"$f":"IF(Lots!A75=\"\",\"\",Lots!EN75)","v":""},{"$f":"IF(Lots!A75=\"\",\"\",Lots!EO75)","v":""},{"$f":"IF(Lots!A75=\"\",\"\",Lots!EP75)","v":""},{"$f":"IF(Lots!A75=\"\",\"\",Lots!EQ75)","v":""},{"$f":"IF(Lots!A75=\"\",\"\",Lots!ER75)","v":""},{"$f":"IF(Lots!A75=\"\",\"\",IF(Lots!ES75=TRUE,\"B\",\"S\"))","v":""}]
[{"$f":"IF(Lots!A76=\"\",\"\",Lots!A76)","v":""},{"$f":"IF(Lots!A76=\"\",\"\",Lots!F76)","v":""},{"$f":"IF(Lots!A76=\"\",\"\",Lots!J76)","v":""},{"$f":"IF(Lots!A76=\"\",\"\",Lots!G76)","v":""},{"$f":"IF(Lots!A76=\"\",\"\",Lots!H76)","v":""},{"$f":"IF(Lots!A76=\"\",\"\",Lots!EA76)","v":""},{"$f":"IF(Lots!A76=\"\",\"\",Lots!EB76)","v":""},{"$f":"IF(Lots!A76=\"\",\"\",Lots!EK76)","v":""},{"$f":"IF(Lots!A76=\"\",\"\",Lots!EF76)","v":""},{"$f":"IF(Lots!F76=\"\",\"\",Lots!EG76)","v":""},{"$f":"IF(Lots!H76=\"\",\"\",Lots!EH76)","v":""},"",{"$f":"IF(A87=\"\",\"\",IF(Lots!ET76=TRUE,\"D\",\"S\"))","v":""},0,0,0,{"$f":"IF(Lots!A76=\"\",\"\",Lots!EM76)","v":""},{"$f":"IF(Lots!A76=\"\",\"\",Lots!EN76)","v":""},{"$f":"IF(Lots!A76=\"\",\"\",Lots!EO76)","v":""},{"$f":"IF(Lots!A76=\"\",\"\",Lots!EP76)","v":""},{"$f":"IF(Lots!A76=\"\",\"\",Lots!EQ76)","v":""},{"$f":"IF(Lots!A76=\"\",\"\",Lots!ER76)","v":""},{"$f":"IF(Lots!A76=\"\",\"\",IF(Lots!ES76=TRUE,\"B\",\"S\"))","v":""}]
[{"$f":"IF(Lots!A77=\"\",\"\",Lots!A77)","v":""},{"$f":"IF(Lots!A77=\"\",\"\",Lots!F77)","v":""},{"$f":"IF(Lots!A77=\"\",\"\",Lots!J77)","v":""},{"$f":"IF(Lots!A77=\"\",\"\",Lots!G77)","v":""},{"$f":"IF(Lots!A77=\"\",\"\",Lots!H77)","v":""},{"$f":"IF(Lots!A77=\"\",\"\",Lots!EA77)","v":""},{"$f":"IF(Lots!A77=\"\",\"\",Lots!EB77)","v":""},{"$f":"IF(Lots!A77=\"\",\"\",Lots!EK77)","v":""},{"$f":"IF(Lots!A77=\"\",\"\",Lots!EF77)","v":""},{"$f":"IF(Lots!F77=\"\",\"\",Lots!EG77)","v":""},{"$f":"IF(Lots!H77=\"\",\"\",Lots!EH77)","v":""},"",{"$f":"IF(A88=\"\",\"\",IF(Lots!ET77=TRUE,\"D\",\"S\"))","v":""},0,0,0,{"$f":"IF(Lots!A77=\"\",\"\",Lots!EM77)","v":""},{"$f":"IF(Lots!A77=\"\",\"\",Lots!EN77)","v":""},{"$f":"IF(Lots!A77=\"\",\"\",Lots!EO77)","v":""},{"$f":"IF(Lots!A77=\"\",\"\",Lots!EP77)","v":""},{"$f":"IF(Lots!A77=\"\",\"\",Lots!EQ77)","v":""},{"$f":"IF(Lots!A77=\"\",\"\",Lots!ER77)","v":""},{"$f":"IF(Lots!A77=\"\",\"\",IF(Lots!ES77=TRUE,\"B\",\"S\"))","v":""}]
[{"$f":"IF(Lots!A78=\"\",\"\",Lots!A78)","v":""},{"$f":"IF(Lots!A78=\"\",\"\",Lots!F78)","v":""},{"$f":"IF(Lots!A78=\"\",\"\",Lots!J78)","v":""},{"$f":"IF(Lots!A78=\"\",\"\",Lots!G78)","v":""},{"$f":"IF(Lots!A78=\"\",\"\",Lots!H78)","v":""},{"$f":"IF(Lots!A78=\"\",\"\",Lots!EA78)","v":""},{"$f":"IF(Lots!A78=\"\",\"\",Lots!EB78)","v":""},{"$f":"IF(Lots!A78=\"\",\"\",Lots!EK78)","v":""},{"$f":"IF(Lots!A78=\"\",\"\",Lots!EF78)","v":""},{"$f":"IF(Lots!F78=\"\",\"\",Lots!EG78)","v":""},{"$f":"IF(Lots!H78=\"\",\"\",Lots!EH78)","v":""},"",{"$f":"IF(A89=\"\",\"\",IF(Lots!ET78=TRUE,\"D\",\"S\"))","v":""},0,0,0,{"$f":"IF(Lots!A78=\"\",\"\",Lots!EM78)","v":""},{"$f":"IF(Lots!A78=\"\",\"\",Lots!EN78)","v":""},{"$f":"IF(Lots!A78=\"\",\"\",Lots!EO78)","v":""},{"$f":"IF(Lots!A78=\"\",\"\",Lots!EP78)","v":""},{"$f":"IF(Lots!A78=\"\",\"\",Lots!EQ78)","v":""},{"$f":"IF(Lots!A78=\"\",\"\",Lots!ER78)","v":""},{"$f":"IF(Lots!A78=\"\",\"\",IF(Lots!ES78=TRUE,\"B\",\"S\"))","v":""}]
[{"$f":"IF(Lots!A79=\"\",\"\",Lots!A79)","v":""},{"$f":"IF(Lots!A79=\"\",\"\",Lots!F79)","v":""},{"$f":"IF(Lots!A79=\"\",\"\",Lots!J79)","v":""},{"$f":"IF(Lots!A79=\"\",\"\",Lots!G79)","v":""},{"$f":"IF(Lots!A79=\"\",\"\",Lots!H79)","v":""},{"$f":"IF(Lots!A79=\"\",\"\",Lots!EA79)","v":""},{"$f":"IF(Lots!A79=\"\",\"\",Lots!EB79)","v":""},{"$f":"IF(Lots!A79=\"\",\"\",Lots!EK79)","v":""},{"$f":"IF(Lots!A79=\"\",\"\",Lots!EF79)","v":""},{"$f":"IF(Lots!F79=\"\",\"\",Lots!EG79)","v":""},{"$f":"IF(Lots!H79=\"\",\"\",Lots!EH79)","v":""},"",{"$f":"IF(A90=\"\",\"\",IF(Lots!ET79=TRUE,\"D\",\"S\"))","v":""},0,0,0,{"$f":"IF(Lots!A79=\"\",\"\",Lots!EM79)","v":""},{"$f":"IF(Lots!A79=\"\",\"\",Lots!EN79)","v":""},{"$f":"IF(Lots!A79=\"\",\"\",Lots!EO79)","v":""},{"$f":"IF(Lots!A79=\"\",\"\",Lots!EP79)","v":""},{"$f":"IF(Lots!A79=\"\",\"\",Lots!EQ79)","v":""},{"$f":"IF(Lots!A79=\"\",\"\",Lots!ER79)","v":""},{"$f":"IF(Lots!A79=\"\",\"\",IF(Lots!ES79=TRUE,\"B\",\"S\"))","v":""}]
[{"$f":"IF(Lots!A80=\"\",\"\",Lots!A80)","v":""},{"$f":"IF(Lots!A80=\"\",\"\",Lots!F80)","v":""},{"$f":"IF(Lots!A80=\"\",\"\",Lots!J80)","v":""},{"$f":"IF(Lots!A80=\"\",\"\",Lots!G80)","v":""},{"$f":"IF(Lots!A80=\"\",\"\",Lots!H80)","v":""},{"$f":"IF(Lots!A80=\"\",\"\",Lots!EA80)","v":""},{"$f":"IF(Lots!A80=\"\",\"\",Lots!EB80)","v":""},{"$f":"IF(Lots!A80=\"\",\"\",Lots!EK80)","v":""},{"$f":"IF(Lots!A80=\"\",\"\",Lots!EF80)","v":""},{"$f":"IF(Lots!F80=\"\",\"\",Lots!EG80)","v":""},{"$f":"IF(Lots!H80=\"\",\"\",Lots!EH80)","v":""},"",{"$f":"IF(A91=\"\",\"\",IF(Lots!ET80=TRUE,\"D\",\"S\"))","v":""},0,0,0,{"$f":"IF(Lots!A80=\"\",\"\",Lots!EM80)","v":""},{"$f":"IF(Lots!A80=\"\",\"\",Lots!EN80)","v":""},{"$f":"IF(Lots!A80=\"\",\"\",Lots!EO80)","v":""},{"$f":"IF(Lots!A80=\"\",\"\",Lots!EP80)","v":""},{"$f":"IF(Lots!A80=\"\",\"\",Lots!EQ80)","v":""},{"$f":"IF(Lots!A80=\"\",\"\",Lots!ER80)","v":""},{"$f":"IF(Lots!A80=\"\",\"\",IF(Lots!ES80=TRUE,\"B\",\"S\"))","v":""}]
[{"$f":"IF(Lots!A81=\"\",\"\",Lots!A81)","v":""},{"$f":"IF(Lots!A81=\"\",\"\",Lots!F81)","v":""},{"$f":"IF(Lots!A81=\"\",\"\",Lots!J81)","v":""},{"$f":"IF(Lots!A81=\"\",\"\",Lots!G81)","v":""},{"$f":"IF(Lots!A81=\"\",\"\",Lots!H81)","v":""},{"$f":"IF(Lots!A81=\"\",\"\",Lots!EA81)","v":""},{"$f":"IF(Lots!A81=\"\",\"\",Lots!EB81)","v":""},{"$f":"IF(Lots!A81=\"\",\"\",Lots!EK81)","v":""},{"$f":"IF(Lots!A81=\"\",\"\",Lots!EF81)","v":""},{"$f":"IF(Lots!F81=\"\",\"\",Lots!EG81)","v":""},{"$f":"IF(Lots!H81=\"\",\"\",Lots!EH81)","v":""},"",{"$f":"IF(A92=\"\",\"\",IF(Lots!ET81=TRUE,\"D\",\"S\"))","v":""},0,0,0,{"$f":"IF(Lots!A81=\"\",\"\",Lots!EM81)","v":""},{"$f":"IF(Lots!A81=\"\",\"\",Lots!EN81)","v":""},{"$f":"IF(Lots!A81=\"\",\"\",Lots!EO81)","v":""},{"$f":"IF(Lots!A81=\"\",\"\",Lots!EP81)","v":""},{"$f":"IF(Lots!A81=\"\",\"\",Lots!EQ81)","v":""},{"$f":"IF(Lots!A81=\"\",\"\",Lots!ER81)","v":""},{"$f":"IF(Lots!A81=\"\",\"\",IF(Lots!ES81=TRUE,\"B\",\"S\"))","v":""}]
[{"$f":"IF(Lots!A82=\"\",\"\",Lots!A82)","v":""},{"$f":"IF(Lots!A82=\"\",\"\",Lots!F82)","v":""},{"$f":"IF(Lots!A82=\"\",\"\",Lots!J82)","v":""},{"$f":"IF(Lots!A82=\"\",\"\",Lots!G82)","v":""},{"$f":"IF(Lots!A82=\"\",\"\",Lots!H82)","v":""},{"$f":"IF(Lots!A82=\"\",\"\",Lots!EA82)","v":""},{"$f":"IF(Lots!A82=\"\",\"\",Lots!EB82)","v":""},{"$f":"IF(Lots!A82=\"\",\"\",Lots!EK82)","v":""},{"$f":"IF(Lots!A82=\"\",\"\",Lots!EF82)","v":""},{"$f":"IF(Lots!F82=\"\",\"\",Lots!EG82)","v":""},{"$f":"IF(Lots!H82=\"\",\"\",Lots!EH82)","v":""},"",{"$f":"IF(A93=\"\",\"\",IF(Lots!ET82=TRUE,\"D\",\"S\"))","v":""},0,0,0,{"$f":"IF(Lots!A82=\"\",\"\",Lots!EM82)","v":""},{"$f":"IF(Lots!A82=\"\",\"\",Lots!EN82)","v":""},{"$f":"IF(Lots!A82=\"\",\"\",Lots!EO82)","v":""},{"$f":"IF(Lots!A82=\"\",\"\",Lots!EP82)","v":""},{"$f":"IF(Lots!A82=\"\",\"\",Lots!EQ82)","v":""},{"$f":"IF(Lots!A82=\"\",\"\",Lots!ER82)","v":""},{"$f":"IF(Lots!A82=\"\",\"\",IF(Lots!ES82=TRUE,\"B\",\"S\"))","v":""}]
[{"$f":"IF(Lots!A83=\"\",\"\",Lots!A83)","v":""},{"$f":"IF(Lots!A83=\"\",\"\",Lots!F83)","v":""},{"$f":"IF(Lots!A83=\"\",\"\",Lots!J83)","v":""},{"$f":"IF(Lots!A83=\"\",\"\",Lots!G83)","v":""},{"$f":"IF(Lots!A83=\"\",\"\",Lots!H83)","v":""},{"$f":"IF(Lots!A83=\"\",\"\",Lots!EA83)","v":""},{"$f":"IF(Lots!A83=\"\",\"\",Lots!EB83)","v":""},{"$f":"IF(Lots!A83=\"\",\"\",Lots!EK83)","v":""},{"$f":"IF(Lots!A83=\"\",\"\",Lots!EF83)","v":""},{"$f":"IF(Lots!F83=\"\",\"\",Lots!EG83)","v":""},{"$f":"IF(Lots!H83=\"\",\"\",Lots!EH83)","v":""},"",{"$f":"IF(A94=\"\",\"\",IF(Lots!ET83=TRUE,\"D\",\"S\"))","v":""},0,0,0,{"$f":"IF(Lots!A83=\"\",\"\",Lots!EM83)","v":""},{"$f":"IF(Lots!A83=\"\",\"\",Lots!EN83)","v":""},{"$f":"IF(Lots!A83=\"\",\"\",Lots!EO83)","v":""},{"$f":"IF(Lots!A83=\"\",\"\",Lots!EP83)","v":""},{"$f":"IF(Lots!A83=\"\",\"\",Lots!EQ83)","v":""},{"$f":"IF(Lots!A83=\"\",\"\",Lots!ER83)","v":""},{"$f":"IF(Lots!A83=\"\",\"\",IF(Lots!ES83=TRUE,\"B\",\"S\"))","v":""}]
[{"$f":"IF(Lots!A84=\"\",\"\",Lots!A84)","v":""},{"$f":"IF(Lots!A84=\"\",\"\",Lots!F84)","v":""},{"$f":"IF(Lots!A84=\"\",\"\",Lots!J84)","v":""},{"$f":"IF(Lots!A84=\"\",\"\",Lots!G84)","v":""},{"$f":"IF(Lots!A84=\"\",\"\",Lots!H84)","v":""},{"$f":"IF(Lots!A84=\"\",\"\",Lots!EA84)","v":""},{"$f":"IF(Lots!A84=\"\",\"\",Lots!EB84)","v":""},{"$f":"IF(Lots!A84=\"\",\"\",Lots!EK84)","v":""},{"$f":"IF(Lots!A84=\"\",\"\",Lots!EF84)","v":""},{"$f":"IF(Lots!F84=\"\",\"\",Lots!EG84)","v":""},{"$f":"IF(Lots!H84=\"\",\"\",Lots!EH84)","v":""},"",{"$f":"IF(A95=\"\",\"\",IF(Lots!ET84=TRUE,\"D\",\"S\"))","v":""},0,0,0,{"$f":"IF(Lots!A84=\"\",\"\",Lots!EM84)","v":""},{"$f":"IF(Lots!A84=\"\",\"\",Lots!EN84)","v":""},{"$f":"IF(Lots!A84=\"\",\"\",Lots!EO84)","v":""},{"$f":"IF(Lots!A84=\"\",\"\",Lots!EP84)","v":""},{"$f":"IF(Lots!A84=\"\",\"\",Lots!EQ84)","v":""},{"$f":"IF(Lots!A84=\"\",\"\",Lots!ER84)","v":""},{"$f":"IF(Lots!A84=\"\",\"\",IF(Lots!ES84=TRUE,\"B\",\"S\"))","v":""}]
[{"$f":"IF(Lots!A85=\"\",\"\",Lots!A85)","v":""},{"$f":"IF(Lots!A85=\"\",\"\",Lots!F85)","v":""},{"$f":"IF(Lots!A85=\"\",\"\",Lots!J85)","v":""},{"$f":"IF(Lots!A85=\"\",\"\",Lots!G85)","v":""},{"$f":"IF(Lots!A85=\"\",\"\",Lots!H85)","v":""},{"$f":"IF(Lots!A85=\"\",\"\",Lots!EA85)","v":""},{"$f":"IF(Lots!A85=\"\",\"\",Lots!EB85)","v":""},{"$f":"IF(Lots!A85=\"\",\"\",Lots!EK85)","v":""},{"$f":"IF(Lots!A85=\"\",\"\",Lots!EF85)","v":""},{"$f":"IF(Lots!F85=\"\",\"\",Lots!EG85)","v":""},{"$f":"IF(Lots!H85=\"\",\"\",Lots!EH85)","v":""},"",{"$f":"IF(A96=\"\",\"\",IF(Lots!ET85=TRUE,\"D\",\"S\"))","v":""},0,0,0,{"$f":"IF(Lots!A85=\"\",\"\",Lots!EM85)","v":""},{"$f":"IF(Lots!A85=\"\",\"\",Lots!EN85)","v":""},{"$f":"IF(Lots!A85=\"\",\"\",Lots!EO85)","v":""},{"$f":"IF(Lots!A85=\"\",\"\",Lots!EP85)","v":""},{"$f":"IF(Lots!A85=\"\",\"\",Lots!EQ85)","v":""},{"$f":"IF(Lots!A85=\"\",\"\",Lots!ER85)","v":""},{"$f":"IF(Lots!A85=\"\",\"\",IF(Lots!ES85=TRUE,\"B\",\"S\"))","v":""}]
[{"$f":"IF(Lots!A86=\"\",\"\",Lots!A86)","v":""},{"$f":"IF(Lots!A86=\"\",\"\",Lots!F86)","v":""},{"$f":"IF(Lots!A86=\"\",\"\",Lots!J86)","v":""},{"$f":"IF(Lots!A86=\"\",\"\",Lots!G86)","v":""},{"$f":"IF(Lots!A86=\"\",\"\",Lots!H86)","v":""},{"$f":"IF(Lots!A86=\"\",\"\",Lots!EA86)","v":""},{"$f":"IF(Lots!A86=\"\",\"\",Lots!EB86)","v":""},{"$f":"IF(Lots!A86=\"\",\"\",Lots!EK86)","v":""},{"$f":"IF(Lots!A86=\"\",\"\",Lots!EF86)","v":""},{"$f":"IF(Lots!F86=\"\",\"\",Lots!EG86)","v":""},{"$f":"IF(Lots!H86=\"\",\"\",Lots!EH86)","v":""},"",{"$f":"IF(A97=\"\",\"\",IF(Lots!ET86=TRUE,\"D\",\"S\"))","v":""},0,0,0,{"$f":"IF(Lots!A86=\"\",\"\",Lots!EM86)","v":""},{"$f":"IF(Lots!A86=\"\",\"\",Lots!EN86)","v":""},{"$f":"IF(Lots!A86=\"\",\"\",Lots!EO86)","v":""},{"$f":"IF(Lots!A86=\"\",\"\",Lots!EP86)","v":""},{"$f":"IF(Lots!A86=\"\",\"\",Lots!EQ86)","v":""},{"$f":"IF(Lots!A86=\"\",\"\",Lots!ER86)","v":""},{"$f":"IF(Lots!A86=\"\",\"\",IF(Lots!ES86=TRUE,\"B\",\"S\"))","v":""}]
[{"$f":"IF(Lots!A87=\"\",\"\",Lots!A87)","v":""},{"$f":"IF(Lots!A87=\"\",\"\",Lots!F87)","v":""},{"$f":"IF(Lots!A87=\"\",\"\",Lots!J87)","v":""},{"$f":"IF(Lots!A87=\"\",\"\",Lots!G87)","v":""},{"$f":"IF(Lots!A87=\"\",\"\",Lots!H87)","v":""},{"$f":"IF(Lots!A87=\"\",\"\",Lots!EA87)","v":""},{"$f":"IF(Lots!A87=\"\",\"\",Lots!EB87)","v":""},{"$f":"IF(Lots!A87=\"\",\"\",Lots!EK87)","v":""},{"$f":"IF(Lots!A87=\"\",\"\",Lots!EF87)","v":""},{"$f":"IF(Lots!F87=\"\",\"\",Lots!EG87)","v":""},{"$f":"IF(Lots!H87=\"\",\"\",Lots!EH87)","v":""},"",{"$f":"IF(A98=\"\",\"\",IF(Lots!ET87=TRUE,\"D\",\"S\"))","v":""},0,0,0,{"$f":"IF(Lots!A87=\"\",\"\",Lots!EM87)","v":""},{"$f":"IF(Lots!A87=\"\",\"\",Lots!EN87)","v":""},{"$f":"IF(Lots!A87=\"\",\"\",Lots!EO87)","v":""},{"$f":"IF(Lots!A87=\"\",\"\",Lots!EP87)","v":""},{"$f":"IF(Lots!A87=\"\",\"\",Lots!EQ87)","v":""},{"$f":"IF(Lots!A87=\"\",\"\",Lots!ER87)","v":""},{"$f":"IF(Lots!A87=\"\",\"\",IF(Lots!ES87=TRUE,\"B\",\"S\"))","v":""}]
[{"$f":"IF(Lots!A88=\"\",\"\",Lots!A88)","v":""},{"$f":"IF(Lots!A88=\"\",\"\",Lots!F88)","v":""},{"$f":"IF(Lots!A88=\"\",\"\",Lots!J88)","v":""},{"$f":"IF(Lots!A88=\"\",\"\",Lots!G88)","v":""},{"$f":"IF(Lots!A88=\"\",\"\",Lots!H88)","v":""},{"$f":"IF(Lots!A88=\"\",\"\",Lots!EA88)","v":""},{"$f":"IF(Lots!A88=\"\",\"\",Lots!EB88)","v":""},{"$f":"IF(Lots!A88=\"\",\"\",Lots!EK88)","v":""},{"$f":"IF(Lots!A88=\"\",\"\",Lots!EF88)","v":""},{"$f":"IF(Lots!F88=\"\",\"\",Lots!EG88)","v":""},{"$f":"IF(Lots!H88=\"\",\"\",Lots!EH88)","v":""},"",{"$f":"IF(A99=\"\",\"\",IF(Lots!ET88=TRUE,\"D\",\"S\"))","v":""},0,0,0,{"$f":"IF(Lots!A88=\"\",\"\",Lots!EM88)","v":""},{"$f":"IF(Lots!A88=\"\",\"\",Lots!EN88)","v":""},{"$f":"IF(Lots!A88=\"\",\"\",Lots!EO88)","v":""},{"$f":"IF(Lots!A88=\"\",\"\",Lots!EP88)","v":""},{"$f":"IF(Lots!A88=\"\",\"\",Lots!EQ88)","v":""},{"$f":"IF(Lots!A88=\"\",\"\",Lots!ER88)","v":""},{"$f":"IF(Lots!A88=\"\",\"\",IF(Lots!ES88=TRUE,\"B\",\"S\"))","v":""}]
[{"$f":"IF(Lots!A89=\"\",\"\",Lots!A89)","v":""},{"$f":"IF(Lots!A89=\"\",\"\",Lots!F89)","v":""},{"$f":"IF(Lots!A89=\"\",\"\",Lots!J89)","v":""},{"$f":"IF(Lots!A89=\"\",\"\",Lots!G89)","v":""},{"$f":"IF(Lots!A89=\"\",\"\",Lots!H89)","v":""},{"$f":"IF(Lots!A89=\"\",\"\",Lots!EA89)","v":""},{"$f":"IF(Lots!A89=\"\",\"\",Lots!EB89)","v":""},{"$f":"IF(Lots!A89=\"\",\"\",Lots!EK89)","v":""},{"$f":"IF(Lots!A89=\"\",\"\",Lots!EF89)","v":""},{"$f":"IF(Lots!F89=\"\",\"\",Lots!EG89)","v":""},{"$f":"IF(Lots!H89=\"\",\"\",Lots!EH89)","v":""},"",{"$f":"IF(A100=\"\",\"\",IF(Lots!ET89=TRUE,\"D\",\"S\"))","v":""},0,0,0,{"$f":"IF(Lots!A89=\"\",\"\",Lots!EM89)","v":""},{"$f":"IF(Lots!A89=\"\",\"\",Lots!EN89)","v":""},{"$f":"IF(Lots!A89=\"\",\"\",Lots!EO89)","v":""},{"$f":"IF(Lots!A89=\"\",\"\",Lots!EP89)","v":""},{"$f":"IF(Lots!A89=\"\",\"\",Lots!EQ89)","v":""},{"$f":"IF(Lots!A89=\"\",\"\",Lots!ER89)","v":""},{"$f":"IF(Lots!A89=\"\",\"\",IF(Lots!ES89=TRUE,\"B\",\"S\"))","v":""}]
[{"$f":"IF(Lots!A90=\"\",\"\",Lots!A90)","v":""},{"$f":"IF(Lots!A90=\"\",\"\",Lots!F90)","v":""},{"$f":"IF(Lots!A90=\"\",\"\",Lots!J90)","v":""},{"$f":"IF(Lots!A90=\"\",\"\",Lots!G90)","v":""},{"$f":"IF(Lots!A90=\"\",\"\",Lots!H90)","v":""},{"$f":"IF(Lots!A90=\"\",\"\",Lots!EA90)","v":""},{"$f":"IF(Lots!A90=\"\",\"\",Lots!EB90)","v":""},{"$f":"IF(Lots!A90=\"\",\"\",Lots!EK90)","v":""},{"$f":"IF(Lots!A90=\"\",\"\",Lots!EF90)","v":""},{"$f":"IF(Lots!F90=\"\",\"\",Lots!EG90)","v":""},{"$f":"IF(Lots!H90=\"\",\"\",Lots!EH90)","v":""},"",{"$f":"IF(A101=\"\",\"\",IF(Lots!ET90=TRUE,\"D\",\"S\"))","v":""},{"$f":"IF(A101=\"\",0,$A$8/100*D101*B101)","v":0},{"$f":"IF(A101=\"\",0,$A$8/100*E101*C101)","v":0},{"$f":"IF(I101>50,0,L101)","v":0},{"$f":"IF(Lots!A90=\"\",\"\",Lots!EM90)","v":""},{"$f":"IF(Lots!A90=\"\",\"\",Lots!EN90)","v":""},{"$f":"IF(Lots!A90=\"\",\"\",Lots!EO90)","v":""},{"$f":"IF(Lots!A90=\"\",\"\",Lots!EP90)","v":""},{"$f":"IF(Lots!A90=\"\",\"\",Lots!EQ90)","v":""},{"$f":"IF(Lots!A90=\"\",\"\",Lots!ER90)","v":""},{"$f":"IF(Lots!A90=\"\",\"\",IF(Lots!ES90=TRUE,\"B\",\"S\"))","v":""}]
[{"$f":"IF(Lots!A91=\"\",\"\",Lots!A91)","v":""},{"$f":"IF(Lots!A91=\"\",\"\",Lots!F91)","v":""},{"$f":"IF(Lots!A91=\"\",\"\",Lots!J91)","v":""},{"$f":"IF(Lots!A91=\"\",\"\",Lots!G91)","v":""},{"$f":"IF(Lots!A91=\"\",\"\",Lots!H91)","v":""},{"$f":"IF(Lots!A91=\"\",\"\",Lots!EA91)","v":""},{"$f":"IF(Lots!A91=\"\",\"\",Lots!EB91)","v":""},{"$f":"IF(Lots!A91=\"\",\"\",Lots!EK91)","v":""},{"$f":"IF(Lots!A91=\"\",\"\",Lots!EF91)","v":""},{"$f":"IF(Lots!F91=\"\",\"\",Lots!EG91)","v":""},{"$f":"IF(Lots!H91=\"\",\"\",Lots!EH91)","v":""},"",{"$f":"IF(A102=\"\",\"\",IF(Lots!ET91=TRUE,\"D\",\"S\"))","v":""},0,0,0,{"$f":"IF(Lots!A91=\"\",\"\",Lots!EM91)","v":""},{"$f":"IF(Lots!A91=\"\",\"\",Lots!EN91)","v":""},{"$f":"IF(Lots!A91=\"\",\"\",Lots!EO91)","v":""},{"$f":"IF(Lots!A91=\"\",\"\",Lots!EP91)","v":""},{"$f":"IF(Lots!A91=\"\",\"\",Lots!EQ91)","v":""},{"$f":"IF(Lots!A91=\"\",\"\",Lots!ER91)","v":""},{"$f":"IF(Lots!A91=\"\",\"\",IF(Lots!ES91=TRUE,\"B\",\"S\"))","v":""}]
[{"$f":"IF(Lots!A92=\"\",\"\",Lots!A92)","v":""},{"$f":"IF(Lots!A92=\"\",\"\",Lots!F92)","v":""},{"$f":"IF(Lots!A92=\"\",\"\",Lots!J92)","v":""},{"$f":"IF(Lots!A92=\"\",\"\",Lots!G92)","v":""},{"$f":"IF(Lots!A92=\"\",\"\",Lots!H92)","v":""},{"$f":"IF(Lots!A92=\"\",\"\",Lots!EA92)","v":""},{"$f":"IF(Lots!A92=\"\",\"\",Lots!EB92)","v":""},{"$f":"IF(Lots!A92=\"\",\"\",Lots!EK92)","v":""},{"$f":"IF(Lots!A92=\"\",\"\",Lots!EF92)","v":""},{"$f":"IF(Lots!F92=\"\",\"\",Lots!EG92)","v":""},{"$f":"IF(Lots!H92=\"\",\"\",Lots!EH92)","v":""},"",{"$f":"IF(A103=\"\",\"\",IF(Lots!ET92=TRUE,\"D\",\"S\"))","v":""},0,0,0,{"$f":"IF(Lots!A92=\"\",\"\",Lots!EM92)","v":""},{"$f":"IF(Lots!A92=\"\",\"\",Lots!EN92)","v":""},{"$f":"IF(Lots!A92=\"\",\"\",Lots!EO92)","v":""},{"$f":"IF(Lots!A92=\"\",\"\",Lots!EP92)","v":""},{"$f":"IF(Lots!A92=\"\",\"\",Lots!EQ92)","v":""},{"$f":"IF(Lots!A92=\"\",\"\",Lots!ER92)","v":""},{"$f":"IF(Lots!A92=\"\",\"\",IF(Lots!ES92=TRUE,\"B\",\"S\"))","v":""}]
[{"$f":"IF(Lots!A93=\"\",\"\",Lots!A93)","v":""},{"$f":"IF(Lots!A93=\"\",\"\",Lots!F93)","v":""},{"$f":"IF(Lots!A93=\"\",\"\",Lots!J93)","v":""},{"$f":"IF(Lots!A93=\"\",\"\",Lots!G93)","v":""},{"$f":"IF(Lots!A93=\"\",\"\",Lots!H93)","v":""},{"$f":"IF(Lots!A93=\"\",\"\",Lots!EA93)","v":""},{"$f":"IF(Lots!A93=\"\",\"\",Lots!EB93)","v":""},{"$f":"IF(Lots!A93=\"\",\"\",Lots!EK93)","v":""},{"$f":"IF(Lots!A93=\"\",\"\",Lots!EF93)","v":""},{"$f":"IF(Lots!F93=\"\",\"\",Lots!EG93)","v":""},{"$f":"IF(Lots!H93=\"\",\"\",Lots!EH93)","v":""},"",{"$f":"IF(A104=\"\",\"\",IF(Lots!ET93=TRUE,\"D\",\"S\"))","v":""},0,0,0,{"$f":"IF(Lots!A93=\"\",\"\",Lots!EM93)","v":""},{"$f":"IF(Lots!A93=\"\",\"\",Lots!EN93)","v":""},{"$f":"IF(Lots!A93=\"\",\"\",Lots!EO93)","v":""},{"$f":"IF(Lots!A93=\"\",\"\",Lots!EP93)","v":""},{"$f":"IF(Lots!A93=\"\",\"\",Lots!EQ93)","v":""},{"$f":"IF(Lots!A93=\"\",\"\",Lots!ER93)","v":""},{"$f":"IF(Lots!A93=\"\",\"\",IF(Lots!ES93=TRUE,\"B\",\"S\"))","v":""}]
[{"$f":"IF(Lots!A94=\"\",\"\",Lots!A94)","v":""},{"$f":"IF(Lots!A94=\"\",\"\",Lots!F94)","v":""},{"$f":"IF(Lots!A94=\"\",\"\",Lots!J94)","v":""},{"$f":"IF(Lots!A94=\"\",\"\",Lots!G94)","v":""},{"$f":"IF(Lots!A94=\"\",\"\",Lots!H94)","v":""},{"$f":"IF(Lots!A94=\"\",\"\",Lots!EA94)","v":""},{"$f":"IF(Lots!A94=\"\",\"\",Lots!EB94)","v":""},{"$f":"IF(Lots!A94=\"\",\"\",Lots!EK94)","v":""},{"$f":"IF(Lots!A94=\"\",\"\",Lots!EF94)","v":""},{"$f":"IF(Lots!F94=\"\",\"\",Lots!EG94)","v":""},{"$f":"IF(Lots!H94=\"\",\"\",Lots!EH94)","v":""},"",{"$f":"IF(A105=\"\",\"\",IF(Lots!ET94=TRUE,\"D\",\"S\"))","v":""},0,0,0,{"$f":"IF(Lots!A94=\"\",\"\",Lots!EM94)","v":""},{"$f":"IF(Lots!A94=\"\",\"\",Lots!EN94)","v":""},{"$f":"IF(Lots!A94=\"\",\"\",Lots!EO94)","v":""},{"$f":"IF(Lots!A94=\"\",\"\",Lots!EP94)","v":""},{"$f":"IF(Lots!A94=\"\",\"\",Lots!EQ94)","v":""},{"$f":"IF(Lots!A94=\"\",\"\",Lots!ER94)","v":""},{"$f":"IF(Lots!A94=\"\",\"\",IF(Lots!ES94=TRUE,\"B\",\"S\"))","v":""}]
[{"$f":"IF(Lots!A95=\"\",\"\",Lots!A95)","v":""},{"$f":"IF(Lots!A95=\"\",\"\",Lots!F95)","v":""},{"$f":"IF(Lots!A95=\"\",\"\",Lots!J95)","v":""},{"$f":"IF(Lots!A95=\"\",\"\",Lots!G95)","v":""},{"$f":"IF(Lots!A95=\"\",\"\",Lots!H95)","v":""},{"$f":"IF(Lots!A95=\"\",\"\",Lots!EA95)","v":""},{"$f":"IF(Lots!A95=\"\",\"\",Lots!EB95)","v":""},{"$f":"IF(Lots!A95=\"\",\"\",Lots!EK95)","v":""},{"$f":"IF(Lots!A95=\"\",\"\",Lots!EF95)","v":""},{"$f":"IF(Lots!F95=\"\",\"\",Lots!EG95)","v":""},{"$f":"IF(Lots!H95=\"\",\"\",Lots!EH95)","v":""},"",{"$f":"IF(A106=\"\",\"\",IF(Lots!ET95=TRUE,\"D\",\"S\"))","v":""},0,0,0,{"$f":"IF(Lots!A95=\"\",\"\",Lots!EM95)","v":""},{"$f":"IF(Lots!A95=\"\",\"\",Lots!EN95)","v":""},{"$f":"IF(Lots!A95=\"\",\"\",Lots!EO95)","v":""},{"$f":"IF(Lots!A95=\"\",\"\",Lots!EP95)","v":""},{"$f":"IF(Lots!A95=\"\",\"\",Lots!EQ95)","v":""},{"$f":"IF(Lots!A95=\"\",\"\",Lots!ER95)","v":""},{"$f":"IF(Lots!A95=\"\",\"\",IF(Lots!ES95=TRUE,\"B\",\"S\"))","v":""}]
[{"$f":"IF(Lots!A96=\"\",\"\",Lots!A96)","v":""},{"$f":"IF(Lots!A96=\"\",\"\",Lots!F96)","v":""},{"$f":"IF(Lots!A96=\"\",\"\",Lots!J96)","v":""},{"$f":"IF(Lots!A96=\"\",\"\",Lots!G96)","v":""},{"$f":"IF(Lots!A96=\"\",\"\",Lots!H96)","v":""},{"$f":"IF(Lots!A96=\"\",\"\",Lots!EA96)","v":""},{"$f":"IF(Lots!A96=\"\",\"\",Lots!EB96)","v":""},{"$f":"IF(Lots!A96=\"\",\"\",Lots!EK96)","v":""},{"$f":"IF(Lots!A96=\"\",\"\",Lots!EF96)","v":""},{"$f":"IF(Lots!F96=\"\",\"\",Lots!EG96)","v":""},{"$f":"IF(Lots!H96=\"\",\"\",Lots!EH96)","v":""},"",{"$f":"IF(A107=\"\",\"\",IF(Lots!ET96=TRUE,\"D\",\"S\"))","v":""},0,0,0,{"$f":"IF(Lots!A96=\"\",\"\",Lots!EM96)","v":""},{"$f":"IF(Lots!A96=\"\",\"\",Lots!EN96)","v":""},{"$f":"IF(Lots!A96=\"\",\"\",Lots!EO96)","v":""},{"$f":"IF(Lots!A96=\"\",\"\",Lots!EP96)","v":""},{"$f":"IF(Lots!A96=\"\",\"\",Lots!EQ96)","v":""},{"$f":"IF(Lots!A96=\"\",\"\",Lots!ER96)","v":""},{"$f":"IF(Lots!A96=\"\",\"\",IF(Lots!ES96=TRUE,\"B\",\"S\"))","v":""}]
[{"$f":"IF(Lots!A97=\"\",\"\",Lots!A97)","v":""},{"$f":"IF(Lots!A97=\"\",\"\",Lots!F97)","v":""},{"$f":"IF(Lots!A97=\"\",\"\",Lots!J97)","v":""},{"$f":"IF(Lots!A97=\"\",\"\",Lots!G97)","v":""},{"$f":"IF(Lots!A97=\"\",\"\",Lots!H97)","v":""},{"$f":"IF(Lots!A97=\"\",\"\",Lots!EA97)","v":""},{"$f":"IF(Lots!A97=\"\",\"\",Lots!EB97)","v":""},{"$f":"IF(Lots!A97=\"\",\"\",Lots!EK97)","v":""},{"$f":"IF(Lots!A97=\"\",\"\",Lots!EF97)","v":""},{"$f":"IF(Lots!F97=\"\",\"\",Lots!EG97)","v":""},{"$f":"IF(Lots!H97=\"\",\"\",Lots!EH97)","v":""},"",{"$f":"IF(A108=\"\",\"\",IF(Lots!ET97=TRUE,\"D\",\"S\"))","v":""},0,0,0,{"$f":"IF(Lots!A97=\"\",\"\",Lots!EM97)","v":""},{"$f":"IF(Lots!A97=\"\",\"\",Lots!EN97)","v":""},{"$f":"IF(Lots!A97=\"\",\"\",Lots!EO97)","v":""},{"$f":"IF(Lots!A97=\"\",\"\",Lots!EP97)","v":""},{"$f":"IF(Lots!A97=\"\",\"\",Lots!EQ97)","v":""},{"$f":"IF(Lots!A97=\"\",\"\",Lots!ER97)","v":""},{"$f":"IF(Lots!A97=\"\",\"\",IF(Lots!ES97=TRUE,\"B\",\"S\"))","v":""}]
[{"$f":"IF(Lots!A98=\"\",\"\",Lots!A98)","v":""},{"$f":"IF(Lots!A98=\"\",\"\",Lots!F98)","v":""},{"$f":"IF(Lots!A98=\"\",\"\",Lots!J98)","v":""},{"$f":"IF(Lots!A98=\"\",\"\",Lots!G98)","v":""},{"$f":"IF(Lots!A98=\"\",\"\",Lots!H98)","v":""},{"$f":"IF(Lots!A98=\"\",\"\",Lots!EA98)","v":""},{"$f":"IF(Lots!A98=\"\",\"\",Lots!EB98)","v":""},{"$f":"IF(Lots!A98=\"\",\"\",Lots!EK98)","v":""},{"$f":"IF(Lots!A98=\"\",\"\",Lots!EF98)","v":""},{"$f":"IF(Lots!F98=\"\",\"\",Lots!EG98)","v":""},{"$f":"IF(Lots!H98=\"\",\"\",Lots!EH98)","v":""},"",{"$f":"IF(A109=\"\",\"\",IF(Lots!ET98=TRUE,\"D\",\"S\"))","v":""},0,0,0,{"$f":"IF(Lots!A98=\"\",\"\",Lots!EM98)","v":""},{"$f":"IF(Lots!A98=\"\",\"\",Lots!EN98)","v":""},{"$f":"IF(Lots!A98=\"\",\"\",Lots!EO98)","v":""},{"$f":"IF(Lots!A98=\"\",\"\",Lots!EP98)","v":""},{"$f":"IF(Lots!A98=\"\",\"\",Lots!EQ98)","v":""},{"$f":"IF(Lots!A98=\"\",\"\",Lots!ER98)","v":""},{"$f":"IF(Lots!A98=\"\",\"\",IF(Lots!ES98=TRUE,\"B\",\"S\"))","v":""}]
[{"$f":"IF(Lots!A99=\"\",\"\",Lots!A99)","v":""},{"$f":"IF(Lots!A99=\"\",\"\",Lots!F99)","v":""},{"$f":"IF(Lots!A99=\"\",\"\",Lots!J99)","v":""},{"$f":"IF(Lots!A99=\"\",\"\",Lots!G99)","v":""},{"$f":"IF(Lots!A99=\"\",\"\",Lots!H99)","v":""},{"$f":"IF(Lots!A99=\"\",\"\",Lots!EA99)","v":""},{"$f":"IF(Lots!A99=\"\",\"\",Lots!EB99)","v":""},{"$f":"IF(Lots!A99=\"\",\"\",Lots!EK99)","v":""},{"$f":"IF(Lots!A99=\"\",\"\",Lots!EF99)","v":""},{"$f":"IF(Lots!F99=\"\",\"\",Lots!EG99)","v":""},{"$f":"IF(Lots!H99=\"\",\"\",Lots!EH99)","v":""},"",{"$f":"IF(A110=\"\",\"\",IF(Lots!ET99=TRUE,\"D\",\"S\"))","v":""},0,0,0,{"$f":"IF(Lots!A99=\"\",\"\",Lots!EM99)","v":""},{"$f":"IF(Lots!A99=\"\",\"\",Lots!EN99)","v":""},{"$f":"IF(Lots!A99=\"\",\"\",Lots!EO99)","v":""},{"$f":"IF(Lots!A99=\"\",\"\",Lots!EP99)","v":""},{"$f":"IF(Lots!A99=\"\",\"\",Lots!EQ99)","v":""},{"$f":"IF(Lots!A99=\"\",\"\",Lots!ER99)","v":""},{"$f":"IF(Lots!A99=\"\",\"\",IF(Lots!ES99=TRUE,\"B\",\"S\"))","v":""}]
[{"$f":"IF(Lots!A100=\"\",\"\",Lots!A100)","v":""},{"$f":"IF(Lots!A100=\"\",\"\",Lots!F100)","v":""},{"$f":"IF(Lots!A100=\"\",\"\",Lots!J100)","v":""},{"$f":"IF(Lots!A100=\"\",\"\",Lots!G100)","v":""},{"$f":"IF(Lots!A100=\"\",\"\",Lots!H100)","v":""},{"$f":"IF(Lots!A100=\"\",\"\",Lots!EA100)","v":""},{"$f":"IF(Lots!A100=\"\",\"\",Lots!EB100)","v":""},{"$f":"IF(Lots!A100=\"\",\"\",Lots!EK100)","v":""},{"$f":"IF(Lots!A100=\"\",\"\",Lots!EF100)","v":""},{"$f":"IF(Lots!F100=\"\",\"\",Lots!EG100)","v":""},{"$f":"IF(Lots!H100=\"\",\"\",Lots!EH100)","v":""},"",{"$f":"IF(A111=\"\",\"\",IF(Lots!ET100=TRUE,\"D\",\"S\"))","v":""},0,0,0,{"$f":"IF(Lots!A100=\"\",\"\",Lots!EM100)","v":""},{"$f":"IF(Lots!A100=\"\",\"\",Lots!EN100)","v":""},{"$f":"IF(Lots!A100=\"\",\"\",Lots!EO100)","v":""},{"$f":"IF(Lots!A100=\"\",\"\",Lots!EP100)","v":""},{"$f":"IF(Lots!A100=\"\",\"\",Lots!EQ100)","v":""},{"$f":"IF(Lots!A100=\"\",\"\",Lots!ER100)","v":""},{"$f":"IF(Lots!A100=\"\",\"\",IF(Lots!ES100=TRUE,\"B\",\"S\"))","v":""}]
[{"$f":"IF(Lots!A101=\"\",\"\",Lots!A101)","v":""},{"$f":"IF(Lots!A101=\"\",\"\",Lots!F101)","v":""},{"$f":"IF(Lots!A101=\"\",\"\",Lots!J101)","v":""},{"$f":"IF(Lots!A101=\"\",\"\",Lots!G101)","v":""},{"$f":"IF(Lots!A101=\"\",\"\",Lots!H101)","v":""},{"$f":"IF(Lots!A101=\"\",\"\",Lots!EA101)","v":""},{"$f":"IF(Lots!A101=\"\",\"\",Lots!EB101)","v":""},{"$f":"IF(Lots!A101=\"\",\"\",Lots!EK101)","v":""},{"$f":"IF(Lots!A101=\"\",\"\",Lots!EF101)","v":""},{"$f":"IF(Lots!F101=\"\",\"\",Lots!EG101)","v":""},{"$f":"IF(Lots!H101=\"\",\"\",Lots!EH101)","v":""},"",{"$f":"IF(A112=\"\",\"\",IF(Lots!ET101=TRUE,\"D\",\"S\"))","v":""},0,0,0,{"$f":"IF(Lots!A101=\"\",\"\",Lots!EM101)","v":""},{"$f":"IF(Lots!A101=\"\",\"\",Lots!EN101)","v":""},{"$f":"IF(Lots!A101=\"\",\"\",Lots!EO101)","v":""},{"$f":"IF(Lots!A101=\"\",\"\",Lots!EP101)","v":""},{"$f":"IF(Lots!A101=\"\",\"\",Lots!EQ101)","v":""},{"$f":"IF(Lots!A101=\"\",\"\",Lots!ER101)","v":""},{"$f":"IF(Lots!A101=\"\",\"\",IF(Lots!ES101=TRUE,\"B\",\"S\"))","v":""}]
[{"$f":"IF(Lots!A102=\"\",\"\",Lots!A102)","v":""},{"$f":"IF(Lots!A102=\"\",\"\",Lots!F102)","v":""},{"$f":"IF(Lots!A102=\"\",\"\",Lots!J102)","v":""},{"$f":"IF(Lots!A102=\"\",\"\",Lots!G102)","v":""},{"$f":"IF(Lots!A102=\"\",\"\",Lots!H102)","v":""},{"$f":"IF(Lots!A102=\"\",\"\",Lots!EA102)","v":""},{"$f":"IF(Lots!A102=\"\",\"\",Lots!EB102)","v":""},{"$f":"IF(Lots!A102=\"\",\"\",Lots!EK102)","v":""},{"$f":"IF(Lots!A102=\"\",\"\",Lots!EF102)","v":""},{"$f":"IF(Lots!F102=\"\",\"\",Lots!EG102)","v":""},{"$f":"IF(Lots!H102=\"\",\"\",Lots!EH102)","v":""},"",{"$f":"IF(A113=\"\",\"\",IF(Lots!ET102=TRUE,\"D\",\"S\"))","v":""},0,0,0,{"$f":"IF(Lots!A102=\"\",\"\",Lots!EM102)","v":""},{"$f":"IF(Lots!A102=\"\",\"\",Lots!EN102)","v":""},{"$f":"IF(Lots!A102=\"\",\"\",Lots!EO102)","v":""},{"$f":"IF(Lots!A102=\"\",\"\",Lots!EP102)","v":""},{"$f":"IF(Lots!A102=\"\",\"\",Lots!EQ102)","v":""},{"$f":"IF(Lots!A102=\"\",\"\",Lots!ER102)","v":""},{"$f":"IF(Lots!A102=\"\",\"\",IF(Lots!ES102=TRUE,\"B\",\"S\"))","v":""}]
[{"$f":"IF(Lots!A103=\"\",\"\",Lots!A103)","v":""},{"$f":"IF(Lots!A103=\"\",\"\",Lots!F103)","v":""},{"$f":"IF(Lots!A103=\"\",\"\",Lots!J103)","v":""},{"$f":"IF(Lots!A103=\"\",\"\",Lots!G103)","v":""},{"$f":"IF(Lots!A103=\"\",\"\",Lots!H103)","v":""},{"$f":"IF(Lots!A103=\"\",\"\",Lots!EA103)","v":""},{"$f":"IF(Lots!A103=\"\",\"\",Lots!EB103)","v":""},{"$f":"IF(Lots!A103=\"\",\"\",Lots!EK103)","v":""},{"$f":"IF(Lots!A103=\"\",\"\",Lots!EF103)","v":""},{"$f":"IF(Lots!F103=\"\",\"\",Lots!EG103)","v":""},{"$f":"IF(Lots!H103=\"\",\"\",Lots!EH103)","v":""},"",{"$f":"IF(A114=\"\",\"\",IF(Lots!ET103=TRUE,\"D\",\"S\"))","v":""},0,0,0,{"$f":"IF(Lots!A103=\"\",\"\",Lots!EM103)","v":""},{"$f":"IF(Lots!A103=\"\",\"\",Lots!EN103)","v":""},{"$f":"IF(Lots!A103=\"\",\"\",Lots!EO103)","v":""},{"$f":"IF(Lots!A103=\"\",\"\",Lots!EP103)","v":""},{"$f":"IF(Lots!A103=\"\",\"\",Lots!EQ103)","v":""},{"$f":"IF(Lots!A103=\"\",\"\",Lots!ER103)","v":""},{"$f":"IF(Lots!A103=\"\",\"\",IF(Lots!ES103=TRUE,\"B\",\"S\"))","v":""}]
[{"$f":"IF(Lots!A104=\"\",\"\",Lots!A104)","v":""},{"$f":"IF(Lots!A104=\"\",\"\",Lots!F104)","v":""},{"$f":"IF(Lots!A104=\"\",\"\",Lots!J104)","v":""},{"$f":"IF(Lots!A104=\"\",\"\",Lots!G104)","v":""},{"$f":"IF(Lots!A104=\"\",\"\",Lots!H104)","v":""},{"$f":"IF(Lots!A104=\"\",\"\",Lots!EA104)","v":""},{"$f":"IF(Lots!A104=\"\",\"\",Lots!EB104)","v":""},{"$f":"IF(Lots!A104=\"\",\"\",Lots!EK104)","v":""},{"$f":"IF(Lots!A104=\"\",\"\",Lots!EF104)","v":""},{"$f":"IF(Lots!F104=\"\",\"\",Lots!EG104)","v":""},{"$f":"IF(Lots!H104=\"\",\"\",Lots!EH104)","v":""},"",{"$f":"IF(A115=\"\",\"\",IF(Lots!ET104=TRUE,\"D\",\"S\"))","v":""},0,0,0,{"$f":"IF(Lots!A104=\"\",\"\",Lots!EM104)","v":""},{"$f":"IF(Lots!A104=\"\",\"\",Lots!EN104)","v":""},{"$f":"IF(Lots!A104=\"\",\"\",Lots!EO104)","v":""},{"$f":"IF(Lots!A104=\"\",\"\",Lots!EP104)","v":""},{"$f":"IF(Lots!A104=\"\",\"\",Lots!EQ104)","v":""},{"$f":"IF(Lots!A104=\"\",\"\",Lots!ER104)","v":""},{"$f":"IF(Lots!A104=\"\",\"\",IF(Lots!ES104=TRUE,\"B\",\"S\"))","v":""}]
[{"$f":"IF(Lots!A105=\"\",\"\",Lots!A105)","v":""},{"$f":"IF(Lots!A105=\"\",\"\",Lots!F105)","v":""},{"$f":"IF(Lots!A105=\"\",\"\",Lots!J105)","v":""},{"$f":"IF(Lots!A105=\"\",\"\",Lots!G105)","v":""},{"$f":"IF(Lots!A105=\"\",\"\",Lots!H105)","v":""},{"$f":"IF(Lots!A105=\"\",\"\",Lots!EA105)","v":""},{"$f":"IF(Lots!A105=\"\",\"\",Lots!EB105)","v":""},{"$f":"IF(Lots!A105=\"\",\"\",Lots!EK105)","v":""},{"$f":"IF(Lots!A105=\"\",\"\",Lots!EF105)","v":""},{"$f":"IF(Lots!F105=\"\",\"\",Lots!EG105)","v":""},{"$f":"IF(Lots!H105=\"\",\"\",Lots!EH105)","v":""},"",{"$f":"IF(A116=\"\",\"\",IF(Lots!ET105=TRUE,\"D\",\"S\"))","v":""},0,0,0,{"$f":"IF(Lots!A105=\"\",\"\",Lots!EM105)","v":""},{"$f":"IF(Lots!A105=\"\",\"\",Lots!EN105)","v":""},{"$f":"IF(Lots!A105=\"\",\"\",Lots!EO105)","v":""},{"$f":"IF(Lots!A105=\"\",\"\",Lots!EP105)","v":""},{"$f":"IF(Lots!A105=\"\",\"\",Lots!EQ105)","v":""},{"$f":"IF(Lots!A105=\"\",\"\",Lots!ER105)","v":""},{"$f":"IF(Lots!A105=\"\",\"\",IF(Lots!ES105=TRUE,\"B\",\"S\"))","v":""}]
[{"$f":"IF(Lots!A106=\"\",\"\",Lots!A106)","v":""},{"$f":"IF(Lots!A106=\"\",\"\",Lots!F106)","v":""},{"$f":"IF(Lots!A106=\"\",\"\",Lots!J106)","v":""},{"$f":"IF(Lots!A106=\"\",\"\",Lots!G106)","v":""},{"$f":"IF(Lots!A106=\"\",\"\",Lots!H106)","v":""},{"$f":"IF(Lots!A106=\"\",\"\",Lots!EA106)","v":""},{"$f":"IF(Lots!A106=\"\",\"\",Lots!EB106)","v":""},{"$f":"IF(Lots!A106=\"\",\"\",Lots!EK106)","v":""},{"$f":"IF(Lots!A106=\"\",\"\",Lots!EF106)","v":""},{"$f":"IF(Lots!F106=\"\",\"\",Lots!EG106)","v":""},{"$f":"IF(Lots!H106=\"\",\"\",Lots!EH106)","v":""},"",{"$f":"IF(A117=\"\",\"\",IF(Lots!ET106=TRUE,\"D\",\"S\"))","v":""},0,0,0,{"$f":"IF(Lots!A106=\"\",\"\",Lots!EM106)","v":""},{"$f":"IF(Lots!A106=\"\",\"\",Lots!EN106)","v":""},{"$f":"IF(Lots!A106=\"\",\"\",Lots!EO106)","v":""},{"$f":"IF(Lots!A106=\"\",\"\",Lots!EP106)","v":""},{"$f":"IF(Lots!A106=\"\",\"\",Lots!EQ106)","v":""},{"$f":"IF(Lots!A106=\"\",\"\",Lots!ER106)","v":""},{"$f":"IF(Lots!A106=\"\",\"\",IF(Lots!ES106=TRUE,\"B\",\"S\"))","v":""}]
[{"$f":"IF(Lots!A107=\"\",\"\",Lots!A107)","v":""},{"$f":"IF(Lots!A107=\"\",\"\",Lots!F107)","v":""},{"$f":"IF(Lots!A107=\"\",\"\",Lots!J107)","v":""},{"$f":"IF(Lots!A107=\"\",\"\",Lots!G107)","v":""},{"$f":"IF(Lots!A107=\"\",\"\",Lots!H107)","v":""},{"$f":"IF(Lots!A107=\"\",\"\",Lots!EA107)","v":""},{"$f":"IF(Lots!A107=\"\",\"\",Lots!EB107)","v":""},{"$f":"IF(Lots!A107=\"\",\"\",Lots!EK107)","v":""},{"$f":"IF(Lots!A107=\"\",\"\",Lots!EF107)","v":""},{"$f":"IF(Lots!F107=\"\",\"\",Lots!EG107)","v":""},{"$f":"IF(Lots!H107=\"\",\"\",Lots!EH107)","v":""},"",{"$f":"IF(A118=\"\",\"\",IF(Lots!ET107=TRUE,\"D\",\"S\"))","v":""},0,0,0,{"$f":"IF(Lots!A107=\"\",\"\",Lots!EM107)","v":""},{"$f":"IF(Lots!A107=\"\",\"\",Lots!EN107)","v":""},{"$f":"IF(Lots!A107=\"\",\"\",Lots!EO107)","v":""},{"$f":"IF(Lots!A107=\"\",\"\",Lots!EP107)","v":""},{"$f":"IF(Lots!A107=\"\",\"\",Lots!EQ107)","v":""},{"$f":"IF(Lots!A107=\"\",\"\",Lots!ER107)","v":""},{"$f":"IF(Lots!A107=\"\",\"\",IF(Lots!ES107=TRUE,\"B\",\"S\"))","v":""}]
[{"$f":"IF(Lots!A108=\"\",\"\",Lots!A108)","v":""},{"$f":"IF(Lots!A108=\"\",\"\",Lots!F108)","v":""},{"$f":"IF(Lots!A108=\"\",\"\",Lots!J108)","v":""},{"$f":"IF(Lots!A108=\"\",\"\",Lots!G108)","v":""},{"$f":"IF(Lots!A108=\"\",\"\",Lots!H108)","v":""},{"$f":"IF(Lots!A108=\"\",\"\",Lots!EA108)","v":""},{"$f":"IF(Lots!A108=\"\",\"\",Lots!EB108)","v":""},{"$f":"IF(Lots!A108=\"\",\"\",Lots!EK108)","v":""},{"$f":"IF(Lots!A108=\"\",\"\",Lots!EF108)","v":""},{"$f":"IF(Lots!F108=\"\",\"\",Lots!EG108)","v":""},{"$f":"IF(Lots!H108=\"\",\"\",Lots!EH108)","v":""},"",{"$f":"IF(A119=\"\",\"\",IF(Lots!ET108=TRUE,\"D\",\"S\"))","v":""},0,0,0,{"$f":"IF(Lots!A108=\"\",\"\",Lots!EM108)","v":""},{"$f":"IF(Lots!A108=\"\",\"\",Lots!EN108)","v":""},{"$f":"IF(Lots!A108=\"\",\"\",Lots!EO108)","v":""},{"$f":"IF(Lots!A108=\"\",\"\",Lots!EP108)","v":""},{"$f":"IF(Lots!A108=\"\",\"\",Lots!EQ108)","v":""},{"$f":"IF(Lots!A108=\"\",\"\",Lots!ER108)","v":""},{"$f":"IF(Lots!A108=\"\",\"\",IF(Lots!ES108=TRUE,\"B\",\"S\"))","v":""}]
[{"$f":"IF(Lots!A109=\"\",\"\",Lots!A109)","v":""},{"$f":"IF(Lots!A109=\"\",\"\",Lots!F109)","v":""},{"$f":"IF(Lots!A109=\"\",\"\",Lots!J109)","v":""},{"$f":"IF(Lots!A109=\"\",\"\",Lots!G109)","v":""},{"$f":"IF(Lots!A109=\"\",\"\",Lots!H109)","v":""},{"$f":"IF(Lots!A109=\"\",\"\",Lots!EA109)","v":""},{"$f":"IF(Lots!A109=\"\",\"\",Lots!EB109)","v":""},{"$f":"IF(Lots!A109=\"\",\"\",Lots!EK109)","v":""},{"$f":"IF(Lots!A109=\"\",\"\",Lots!EF109)","v":""},{"$f":"IF(Lots!F109=\"\",\"\",Lots!EG109)","v":""},{"$f":"IF(Lots!H109=\"\",\"\",Lots!EH109)","v":""},"",{"$f":"IF(A120=\"\",\"\",IF(Lots!ET109=TRUE,\"D\",\"S\"))","v":""},0,0,0,{"$f":"IF(Lots!A109=\"\",\"\",Lots!EM109)","v":""},{"$f":"IF(Lots!A109=\"\",\"\",Lots!EN109)","v":""},{"$f":"IF(Lots!A109=\"\",\"\",Lots!EO109)","v":""},{"$f":"IF(Lots!A109=\"\",\"\",Lots!EP109)","v":""},{"$f":"IF(Lots!A109=\"\",\"\",Lots!EQ109)","v":""},{"$f":"IF(Lots!A109=\"\",\"\",Lots!ER109)","v":""},{"$f":"IF(Lots!A109=\"\",\"\",IF(Lots!ES109=TRUE,\"B\",\"S\"))","v":""}]
[{"$f":"IF(Lots!A110=\"\",\"\",Lots!A110)","v":""},{"$f":"IF(Lots!A110=\"\",\"\",Lots!F110)","v":""},{"$f":"IF(Lots!A110=\"\",\"\",Lots!J110)","v":""},{"$f":"IF(Lots!A110=\"\",\"\",Lots!G110)","v":""},{"$f":"IF(Lots!A110=\"\",\"\",Lots!H110)","v":""},{"$f":"IF(Lots!A110=\"\",\"\",Lots!EA110)","v":""},{"$f":"IF(Lots!A110=\"\",\"\",Lots!EB110)","v":""},{"$f":"IF(Lots!A110=\"\",\"\",Lots!EK110)","v":""},{"$f":"IF(Lots!A110=\"\",\"\",Lots!EF110)","v":""},{"$f":"IF(Lots!F110=\"\",\"\",Lots!EG110)","v":""},{"$f":"IF(Lots!H110=\"\",\"\",Lots!EH110)","v":""},"",{"$f":"IF(A121=\"\",\"\",IF(Lots!ET110=TRUE,\"D\",\"S\"))","v":""},0,0,0,{"$f":"IF(Lots!A110=\"\",\"\",Lots!EM110)","v":""},{"$f":"IF(Lots!A110=\"\",\"\",Lots!EN110)","v":""},{"$f":"IF(Lots!A110=\"\",\"\",Lots!EO110)","v":""},{"$f":"IF(Lots!A110=\"\",\"\",Lots!EP110)","v":""},{"$f":"IF(Lots!A110=\"\",\"\",Lots!EQ110)","v":""},{"$f":"IF(Lots!A110=\"\",\"\",Lots!ER110)","v":""},{"$f":"IF(Lots!A110=\"\",\"\",IF(Lots!ES110=TRUE,\"B\",\"S\"))","v":""}]
[{"$f":"IF(Lots!A111=\"\",\"\",Lots!A111)","v":""},{"$f":"IF(Lots!A111=\"\",\"\",Lots!F111)","v":""},{"$f":"IF(Lots!A111=\"\",\"\",Lots!J111)","v":""},{"$f":"IF(Lots!A111=\"\",\"\",Lots!G111)","v":""},{"$f":"IF(Lots!A111=\"\",\"\",Lots!H111)","v":""},{"$f":"IF(Lots!A111=\"\",\"\",Lots!EA111)","v":""},{"$f":"IF(Lots!A111=\"\",\"\",Lots!EB111)","v":""},{"$f":"IF(Lots!A111=\"\",\"\",Lots!EK111)","v":""},{"$f":"IF(Lots!A111=\"\",\"\",Lots!EF111)","v":""},{"$f":"IF(Lots!F111=\"\",\"\",Lots!EG111)","v":""},{"$f":"IF(Lots!H111=\"\",\"\",Lots!EH111)","v":""},"",{"$f":"IF(A122=\"\",\"\",IF(Lots!ET111=TRUE,\"D\",\"S\"))","v":""},0,0,0,{"$f":"IF(Lots!A111=\"\",\"\",Lots!EM111)","v":""},{"$f":"IF(Lots!A111=\"\",\"\",Lots!EN111)","v":""},{"$f":"IF(Lots!A111=\"\",\"\",Lots!EO111)","v":""},{"$f":"IF(Lots!A111=\"\",\"\",Lots!EP111)","v":""},{"$f":"IF(Lots!A111=\"\",\"\",Lots!EQ111)","v":""},{"$f":"IF(Lots!A111=\"\",\"\",Lots!ER111)","v":""},{"$f":"IF(Lots!A111=\"\",\"\",IF(Lots!ES111=TRUE,\"B\",\"S\"))","v":""}]
[{"$f":"IF(Lots!A112=\"\",\"\",Lots!A112)","v":""},{"$f":"IF(Lots!A112=\"\",\"\",Lots!F112)","v":""},{"$f":"IF(Lots!A112=\"\",\"\",Lots!J112)","v":""},{"$f":"IF(Lots!A112=\"\",\"\",Lots!G112)","v":""},{"$f":"IF(Lots!A112=\"\",\"\",Lots!H112)","v":""},{"$f":"IF(Lots!A112=\"\",\"\",Lots!EA112)","v":""},{"$f":"IF(Lots!A112=\"\",\"\",Lots!EB112)","v":""},{"$f":"IF(Lots!A112=\"\",\"\",Lots!EK112)","v":""},{"$f":"IF(Lots!A112=\"\",\"\",Lots!EF112)","v":""},{"$f":"IF(Lots!F112=\"\",\"\",Lots!EG112)","v":""},{"$f":"IF(Lots!H112=\"\",\"\",Lots!EH112)","v":""},"",{"$f":"IF(A123=\"\",\"\",IF(Lots!ET112=TRUE,\"D\",\"S\"))","v":""},0,0,0,{"$f":"IF(Lots!A112=\"\",\"\",Lots!EM112)","v":""},{"$f":"IF(Lots!A112=\"\",\"\",Lots!EN112)","v":""},{"$f":"IF(Lots!A112=\"\",\"\",Lots!EO112)","v":""},{"$f":"IF(Lots!A112=\"\",\"\",Lots!EP112)","v":""},{"$f":"IF(Lots!A112=\"\",\"\",Lots!EQ112)","v":""},{"$f":"IF(Lots!A112=\"\",\"\",Lots!ER112)","v":""},{"$f":"IF(Lots!A112=\"\",\"\",IF(Lots!ES112=TRUE,\"B\",\"S\"))","v":""}]
[{"$f":"IF(Lots!A113=\"\",\"\",Lots!A113)","v":""},{"$f":"IF(Lots!A113=\"\",\"\",Lots!F113)","v":""},{"$f":"IF(Lots!A113=\"\",\"\",Lots!J113)","v":""},{"$f":"IF(Lots!A113=\"\",\"\",Lots!G113)","v":""},{"$f":"IF(Lots!A113=\"\",\"\",Lots!H113)","v":""},{"$f":"IF(Lots!A113=\"\",\"\",Lots!EA113)","v":""},{"$f":"IF(Lots!A113=\"\",\"\",Lots!EB113)","v":""},{"$f":"IF(Lots!A113=\"\",\"\",Lots!EK113)","v":""},{"$f":"IF(Lots!A113=\"\",\"\",Lots!EF113)","v":""},{"$f":"IF(Lots!F113=\"\",\"\",Lots!EG113)","v":""},{"$f":"IF(Lots!H113=\"\",\"\",Lots!EH113)","v":""},"",{"$f":"IF(A124=\"\",\"\",IF(Lots!ET113=TRUE,\"D\",\"S\"))","v":""},0,0,0,{"$f":"IF(Lots!A113=\"\",\"\",Lots!EM113)","v":""},{"$f":"IF(Lots!A113=\"\",\"\",Lots!EN113)","v":""},{"$f":"IF(Lots!A113=\"\",\"\",Lots!EO113)","v":""},{"$f":"IF(Lots!A113=\"\",\"\",Lots!EP113)","v":""},{"$f":"IF(Lots!A113=\"\",\"\",Lots!EQ113)","v":""},{"$f":"IF(Lots!A113=\"\",\"\",Lots!ER113)","v":""},{"$f":"IF(Lots!A113=\"\",\"\",IF(Lots!ES113=TRUE,\"B\",\"S\"))","v":""}]
[{"$f":"IF(Lots!A114=\"\",\"\",Lots!A114)","v":""},{"$f":"IF(Lots!A114=\"\",\"\",Lots!F114)","v":""},{"$f":"IF(Lots!A114=\"\",\"\",Lots!J114)","v":""},{"$f":"IF(Lots!A114=\"\",\"\",Lots!G114)","v":""},{"$f":"IF(Lots!A114=\"\",\"\",Lots!H114)","v":""},{"$f":"IF(Lots!A114=\"\",\"\",Lots!EA114)","v":""},{"$f":"IF(Lots!A114=\"\",\"\",Lots!EB114)","v":""},{"$f":"IF(Lots!A114=\"\",\"\",Lots!EK114)","v":""},{"$f":"IF(Lots!A114=\"\",\"\",Lots!EF114)","v":""},{"$f":"IF(Lots!F114=\"\",\"\",Lots!EG114)","v":""},{"$f":"IF(Lots!H114=\"\",\"\",Lots!EH114)","v":""},"",{"$f":"IF(A125=\"\",\"\",IF(Lots!ET114=TRUE,\"D\",\"S\"))","v":""},0,0,0,{"$f":"IF(Lots!A114=\"\",\"\",Lots!EM114)","v":""},{"$f":"IF(Lots!A114=\"\",\"\",Lots!EN114)","v":""},{"$f":"IF(Lots!A114=\"\",\"\",Lots!EO114)","v":""},{"$f":"IF(Lots!A114=\"\",\"\",Lots!EP114)","v":""},{"$f":"IF(Lots!A114=\"\",\"\",Lots!EQ114)","v":""},{"$f":"IF(Lots!A114=\"\",\"\",Lots!ER114)","v":""},{"$f":"IF(Lots!A114=\"\",\"\",IF(Lots!ES114=TRUE,\"B\",\"S\"))","v":""}]
[{"$f":"IF(Lots!A115=\"\",\"\",Lots!A115)","v":""},{"$f":"IF(Lots!A115=\"\",\"\",Lots!F115)","v":""},{"$f":"IF(Lots!A115=\"\",\"\",Lots!J115)","v":""},{"$f":"IF(Lots!A115=\"\",\"\",Lots!G115)","v":""},{"$f":"IF(Lots!A115=\"\",\"\",Lots!H115)","v":""},{"$f":"IF(Lots!A115=\"\",\"\",Lots!EA115)","v":""},{"$f":"IF(Lots!A115=\"\",\"\",Lots!EB115)","v":""},{"$f":"IF(Lots!A115=\"\",\"\",Lots!EK115)","v":""},{"$f":"IF(Lots!A115=\"\",\"\",Lots!EF115)","v":""},{"$f":"IF(Lots!F115=\"\",\"\",Lots!EG115)","v":""},{"$f":"IF(Lots!H115=\"\",\"\",Lots!EH115)","v":""},"",{"$f":"IF(A126=\"\",\"\",IF(Lots!ET115=TRUE,\"D\",\"S\"))","v":""},0,0,0,{"$f":"IF(Lots!A115=\"\",\"\",Lots!EM115)","v":""},{"$f":"IF(Lots!A115=\"\",\"\",Lots!EN115)","v":""},{"$f":"IF(Lots!A115=\"\",\"\",Lots!EO115)","v":""},{"$f":"IF(Lots!A115=\"\",\"\",Lots!EP115)","v":""},{"$f":"IF(Lots!A115=\"\",\"\",Lots!EQ115)","v":""},{"$f":"IF(Lots!A115=\"\",\"\",Lots!ER115)","v":""},{"$f":"IF(Lots!A115=\"\",\"\",IF(Lots!ES115=TRUE,\"B\",\"S\"))","v":""}]
[{"$f":"IF(Lots!A116=\"\",\"\",Lots!A116)","v":""},{"$f":"IF(Lots!A116=\"\",\"\",Lots!F116)","v":""},{"$f":"IF(Lots!A116=\"\",\"\",Lots!J116)","v":""},{"$f":"IF(Lots!A116=\"\",\"\",Lots!G116)","v":""},{"$f":"IF(Lots!A116=\"\",\"\",Lots!H116)","v":""},{"$f":"IF(Lots!A116=\"\",\"\",Lots!EA116)","v":""},{"$f":"IF(Lots!A116=\"\",\"\",Lots!EB116)","v":""},{"$f":"IF(Lots!A116=\"\",\"\",Lots!EK116)","v":""},{"$f":"IF(Lots!A116=\"\",\"\",Lots!EF116)","v":""},{"$f":"IF(Lots!F116=\"\",\"\",Lots!EG116)","v":""},{"$f":"IF(Lots!H116=\"\",\"\",Lots!EH116)","v":""},"",{"$f":"IF(A127=\"\",\"\",IF(Lots!ET116=TRUE,\"D\",\"S\"))","v":""},0,0,0,{"$f":"IF(Lots!A116=\"\",\"\",Lots!EM116)","v":""},{"$f":"IF(Lots!A116=\"\",\"\",Lots!EN116)","v":""},{"$f":"IF(Lots!A116=\"\",\"\",Lots!EO116)","v":""},{"$f":"IF(Lots!A116=\"\",\"\",Lots!EP116)","v":""},{"$f":"IF(Lots!A116=\"\",\"\",Lots!EQ116)","v":""},{"$f":"IF(Lots!A116=\"\",\"\",Lots!ER116)","v":""},{"$f":"IF(Lots!A116=\"\",\"\",IF(Lots!ES116=TRUE,\"B\",\"S\"))","v":""}]
[{"$f":"IF(Lots!A117=\"\",\"\",Lots!A117)","v":""},{"$f":"IF(Lots!A117=\"\",\"\",Lots!F117)","v":""},{"$f":"IF(Lots!A117=\"\",\"\",Lots!J117)","v":""},{"$f":"IF(Lots!A117=\"\",\"\",Lots!G117)","v":""},{"$f":"IF(Lots!A117=\"\",\"\",Lots!H117)","v":""},{"$f":"IF(Lots!A117=\"\",\"\",Lots!EA117)","v":""},{"$f":"IF(Lots!A117=\"\",\"\",Lots!EB117)","v":""},{"$f":"IF(Lots!A117=\"\",\"\",Lots!EK117)","v":""},{"$f":"IF(Lots!A117=\"\",\"\",Lots!EF117)","v":""},{"$f":"IF(Lots!F117=\"\",\"\",Lots!EG117)","v":""},{"$f":"IF(Lots!H117=\"\",\"\",Lots!EH117)","v":""},"",{"$f":"IF(A128=\"\",\"\",IF(Lots!ET117=TRUE,\"D\",\"S\"))","v":""},0,0,0,{"$f":"IF(Lots!A117=\"\",\"\",Lots!EM117)","v":""},{"$f":"IF(Lots!A117=\"\",\"\",Lots!EN117)","v":""},{"$f":"IF(Lots!A117=\"\",\"\",Lots!EO117)","v":""},{"$f":"IF(Lots!A117=\"\",\"\",Lots!EP117)","v":""},{"$f":"IF(Lots!A117=\"\",\"\",Lots!EQ117)","v":""},{"$f":"IF(Lots!A117=\"\",\"\",Lots!ER117)","v":""},{"$f":"IF(Lots!A117=\"\",\"\",IF(Lots!ES117=TRUE,\"B\",\"S\"))","v":""}]
[{"$f":"IF(Lots!A118=\"\",\"\",Lots!A118)","v":""},{"$f":"IF(Lots!A118=\"\",\"\",Lots!F118)","v":""},{"$f":"IF(Lots!A118=\"\",\"\",Lots!J118)","v":""},{"$f":"IF(Lots!A118=\"\",\"\",Lots!G118)","v":""},{"$f":"IF(Lots!A118=\"\",\"\",Lots!H118)","v":""},{"$f":"IF(Lots!A118=\"\",\"\",Lots!EA118)","v":""},{"$f":"IF(Lots!A118=\"\",\"\",Lots!EB118)","v":""},{"$f":"IF(Lots!A118=\"\",\"\",Lots!EK118)","v":""},{"$f":"IF(Lots!A118=\"\",\"\",Lots!EF118)","v":""},{"$f":"IF(Lots!F118=\"\",\"\",Lots!EG118)","v":""},{"$f":"IF(Lots!H118=\"\",\"\",Lots!EH118)","v":""},"",{"$f":"IF(A129=\"\",\"\",IF(Lots!ET118=TRUE,\"D\",\"S\"))","v":""},0,0,0,{"$f":"IF(Lots!A118=\"\",\"\",Lots!EM118)","v":""},{"$f":"IF(Lots!A118=\"\",\"\",Lots!EN118)","v":""},{"$f":"IF(Lots!A118=\"\",\"\",Lots!EO118)","v":""},{"$f":"IF(Lots!A118=\"\",\"\",Lots!EP118)","v":""},{"$f":"IF(Lots!A118=\"\",\"\",Lots!EQ118)","v":""},{"$f":"IF(Lots!A118=\"\",\"\",Lots!ER118)","v":""},{"$f":"IF(Lots!A118=\"\",\"\",IF(Lots!ES118=TRUE,\"B\",\"S\"))","v":""}]
[{"$f":"IF(Lots!A119=\"\",\"\",Lots!A119)","v":""},{"$f":"IF(Lots!A119=\"\",\"\",Lots!F119)","v":""},{"$f":"IF(Lots!A119=\"\",\"\",Lots!J119)","v":""},{"$f":"IF(Lots!A119=\"\",\"\",Lots!G119)","v":""},{"$f":"IF(Lots!A119=\"\",\"\",Lots!H119)","v":""},{"$f":"IF(Lots!A119=\"\",\"\",Lots!EA119)","v":""},{"$f":"IF(Lots!A119=\"\",\"\",Lots!EB119)","v":""},{"$f":"IF(Lots!A119=\"\",\"\",Lots!EK119)","v":""},{"$f":"IF(Lots!A119=\"\",\"\",Lots!EF119)","v":""},{"$f":"IF(Lots!F119=\"\",\"\",Lots!EG119)","v":""},{"$f":"IF(Lots!H119=\"\",\"\",Lots!EH119)","v":""},"",{"$f":"IF(A130=\"\",\"\",IF(Lots!ET119=TRUE,\"D\",\"S\"))","v":""},0,0,0,{"$f":"IF(Lots!A119=\"\",\"\",Lots!EM119)","v":""},{"$f":"IF(Lots!A119=\"\",\"\",Lots!EN119)","v":""},{"$f":"IF(Lots!A119=\"\",\"\",Lots!EO119)","v":""},{"$f":"IF(Lots!A119=\"\",\"\",Lots!EP119)","v":""},{"$f":"IF(Lots!A119=\"\",\"\",Lots!EQ119)","v":""},{"$f":"IF(Lots!A119=\"\",\"\",Lots!ER119)","v":""},{"$f":"IF(Lots!A119=\"\",\"\",IF(Lots!ES119=TRUE,\"B\",\"S\"))","v":""}]
[{"$f":"IF(Lots!A120=\"\",\"\",Lots!A120)","v":""},{"$f":"IF(Lots!A120=\"\",\"\",Lots!F120)","v":""},{"$f":"IF(Lots!A120=\"\",\"\",Lots!J120)","v":""},{"$f":"IF(Lots!A120=\"\",\"\",Lots!G120)","v":""},{"$f":"IF(Lots!A120=\"\",\"\",Lots!H120)","v":""},{"$f":"IF(Lots!A120=\"\",\"\",Lots!EA120)","v":""},{"$f":"IF(Lots!A120=\"\",\"\",Lots!EB120)","v":""},{"$f":"IF(Lots!A120=\"\",\"\",Lots!EK120)","v":""},{"$f":"IF(Lots!A120=\"\",\"\",Lots!EF120)","v":""},{"$f":"IF(Lots!F120=\"\",\"\",Lots!EG120)","v":""},{"$f":"IF(Lots!H120=\"\",\"\",Lots!EH120)","v":""},"",{"$f":"IF(A131=\"\",\"\",IF(Lots!ET120=TRUE,\"D\",\"S\"))","v":""},0,0,0,{"$f":"IF(Lots!A120=\"\",\"\",Lots!EM120)","v":""},{"$f":"IF(Lots!A120=\"\",\"\",Lots!EN120)","v":""},{"$f":"IF(Lots!A120=\"\",\"\",Lots!EO120)","v":""},{"$f":"IF(Lots!A120=\"\",\"\",Lots!EP120)","v":""},{"$f":"IF(Lots!A120=\"\",\"\",Lots!EQ120)","v":""},{"$f":"IF(Lots!A120=\"\",\"\",Lots!ER120)","v":""},{"$f":"IF(Lots!A120=\"\",\"\",IF(Lots!ES120=TRUE,\"B\",\"S\"))","v":""}]
[{"$f":"IF(Lots!A121=\"\",\"\",Lots!A121)","v":""},{"$f":"IF(Lots!A121=\"\",\"\",Lots!F121)","v":""},{"$f":"IF(Lots!A121=\"\",\"\",Lots!J121)","v":""},{"$f":"IF(Lots!A121=\"\",\"\",Lots!G121)","v":""},{"$f":"IF(Lots!A121=\"\",\"\",Lots!H121)","v":""},{"$f":"IF(Lots!A121=\"\",\"\",Lots!EA121)","v":""},{"$f":"IF(Lots!A121=\"\",\"\",Lots!EB121)","v":""},{"$f":"IF(Lots!A121=\"\",\"\",Lots!EK121)","v":""},{"$f":"IF(Lots!A121=\"\",\"\",Lots!EF121)","v":""},{"$f":"IF(Lots!F121=\"\",\"\",Lots!EG121)","v":""},{"$f":"IF(Lots!H121=\"\",\"\",Lots!EH121)","v":""},"",{"$f":"IF(A132=\"\",\"\",IF(Lots!ET121=TRUE,\"D\",\"S\"))","v":""},0,0,0,{"$f":"IF(Lots!A121=\"\",\"\",Lots!EM121)","v":""},{"$f":"IF(Lots!A121=\"\",\"\",Lots!EN121)","v":""},{"$f":"IF(Lots!A121=\"\",\"\",Lots!EO121)","v":""},{"$f":"IF(Lots!A121=\"\",\"\",Lots!EP121)","v":""},{"$f":"IF(Lots!A121=\"\",\"\",Lots!EQ121)","v":""},{"$f":"IF(Lots!A121=\"\",\"\",Lots!ER121)","v":""},{"$f":"IF(Lots!A121=\"\",\"\",IF(Lots!ES121=TRUE,\"B\",\"S\"))","v":""}]
[{"$f":"IF(Lots!A122=\"\",\"\",Lots!A122)","v":""},{"$f":"IF(Lots!A122=\"\",\"\",Lots!F122)","v":""},{"$f":"IF(Lots!A122=\"\",\"\",Lots!J122)","v":""},{"$f":"IF(Lots!A122=\"\",\"\",Lots!G122)","v":""},{"$f":"IF(Lots!A122=\"\",\"\",Lots!H122)","v":""},{"$f":"IF(Lots!A122=\"\",\"\",Lots!EA122)","v":""},{"$f":"IF(Lots!A122=\"\",\"\",Lots!EB122)","v":""},{"$f":"IF(Lots!A122=\"\",\"\",Lots!EK122)","v":""},{"$f":"IF(Lots!A122=\"\",\"\",Lots!EF122)","v":""},{"$f":"IF(Lots!F122=\"\",\"\",Lots!EG122)","v":""},{"$f":"IF(Lots!H122=\"\",\"\",Lots!EH122)","v":""},"",{"$f":"IF(A133=\"\",\"\",IF(Lots!ET122=TRUE,\"D\",\"S\"))","v":""},0,0,0,{"$f":"IF(Lots!A122=\"\",\"\",Lots!EM122)","v":""},{"$f":"IF(Lots!A122=\"\",\"\",Lots!EN122)","v":""},{"$f":"IF(Lots!A122=\"\",\"\",Lots!EO122)","v":""},{"$f":"IF(Lots!A122=\"\",\"\",Lots!EP122)","v":""},{"$f":"IF(Lots!A122=\"\",\"\",Lots!EQ122)","v":""},{"$f":"IF(Lots!A122=\"\",\"\",Lots!ER122)","v":""},{"$f":"IF(Lots!A122=\"\",\"\",IF(Lots!ES122=TRUE,\"B\",\"S\"))","v":""}]
[{"$f":"IF(Lots!A123=\"\",\"\",Lots!A123)","v":""},{"$f":"IF(Lots!A123=\"\",\"\",Lots!F123)","v":""},{"$f":"IF(Lots!A123=\"\",\"\",Lots!J123)","v":""},{"$f":"IF(Lots!A123=\"\",\"\",Lots!G123)","v":""},{"$f":"IF(Lots!A123=\"\",\"\",Lots!H123)","v":""},{"$f":"IF(Lots!A123=\"\",\"\",Lots!EA123)","v":""},{"$f":"IF(Lots!A123=\"\",\"\",Lots!EB123)","v":""},{"$f":"IF(Lots!A123=\"\",\"\",Lots!EK123)","v":""},{"$f":"IF(Lots!A123=\"\",\"\",Lots!EF123)","v":""},{"$f":"IF(Lots!F123=\"\",\"\",Lots!EG123)","v":""},{"$f":"IF(Lots!H123=\"\",\"\",Lots!EH123)","v":""},"",{"$f":"IF(A134=\"\",\"\",IF(Lots!ET123=TRUE,\"D\",\"S\"))","v":""},0,0,0,{"$f":"IF(Lots!A123=\"\",\"\",Lots!EM123)","v":""},{"$f":"IF(Lots!A123=\"\",\"\",Lots!EN123)","v":""},{"$f":"IF(Lots!A123=\"\",\"\",Lots!EO123)","v":""},{"$f":"IF(Lots!A123=\"\",\"\",Lots!EP123)","v":""},{"$f":"IF(Lots!A123=\"\",\"\",Lots!EQ123)","v":""},{"$f":"IF(Lots!A123=\"\",\"\",Lots!ER123)","v":""},{"$f":"IF(Lots!A123=\"\",\"\",IF(Lots!ES123=TRUE,\"B\",\"S\"))","v":""}]
[{"$f":"IF(Lots!A124=\"\",\"\",Lots!A124)","v":""},{"$f":"IF(Lots!A124=\"\",\"\",Lots!F124)","v":""},{"$f":"IF(Lots!A124=\"\",\"\",Lots!J124)","v":""},{"$f":"IF(Lots!A124=\"\",\"\",Lots!G124)","v":""},{"$f":"IF(Lots!A124=\"\",\"\",Lots!H124)","v":""},{"$f":"IF(Lots!A124=\"\",\"\",Lots!EA124)","v":""},{"$f":"IF(Lots!A124=\"\",\"\",Lots!EB124)","v":""},{"$f":"IF(Lots!A124=\"\",\"\",Lots!EK124)","v":""},{"$f":"IF(Lots!A124=\"\",\"\",Lots!EF124)","v":""},{"$f":"IF(Lots!F124=\"\",\"\",Lots!EG124)","v":""},{"$f":"IF(Lots!H124=\"\",\"\",Lots!EH124)","v":""},"",{"$f":"IF(A135=\"\",\"\",IF(Lots!ET124=TRUE,\"D\",\"S\"))","v":""},0,0,0,{"$f":"IF(Lots!A124=\"\",\"\",Lots!EM124)","v":""},{"$f":"IF(Lots!A124=\"\",\"\",Lots!EN124)","v":""},{"$f":"IF(Lots!A124=\"\",\"\",Lots!EO124)","v":""},{"$f":"IF(Lots!A124=\"\",\"\",Lots!EP124)","v":""},{"$f":"IF(Lots!A124=\"\",\"\",Lots!EQ124)","v":""},{"$f":"IF(Lots!A124=\"\",\"\",Lots!ER124)","v":""},{"$f":"IF(Lots!A124=\"\",\"\",IF(Lots!ES124=TRUE,\"B\",\"S\"))","v":""}]
[{"$f":"IF(Lots!A125=\"\",\"\",Lots!A125)","v":""},{"$f":"IF(Lots!A125=\"\",\"\",Lots!F125)","v":""},{"$f":"IF(Lots!A125=\"\",\"\",Lots!J125)","v":""},{"$f":"IF(Lots!A125=\"\",\"\",Lots!G125)","v":""},{"$f":"IF(Lots!A125=\"\",\"\",Lots!H125)","v":""},{"$f":"IF(Lots!A125=\"\",\"\",Lots!EA125)","v":""},{"$f":"IF(Lots!A125=\"\",\"\",Lots!EB125)","v":""},{"$f":"IF(Lots!A125=\"\",\"\",Lots!EK125)","v":""},{"$f":"IF(Lots!A125=\"\",\"\",Lots!EF125)","v":""},{"$f":"IF(Lots!F125=\"\",\"\",Lots!EG125)","v":""},{"$f":"IF(Lots!H125=\"\",\"\",Lots!EH125)","v":""},"",{"$f":"IF(A136=\"\",\"\",IF(Lots!ET125=TRUE,\"D\",\"S\"))","v":""},0,0,0,{"$f":"IF(Lots!A125=\"\",\"\",Lots!EM125)","v":""},{"$f":"IF(Lots!A125=\"\",\"\",Lots!EN125)","v":""},{"$f":"IF(Lots!A125=\"\",\"\",Lots!EO125)","v":""},{"$f":"IF(Lots!A125=\"\",\"\",Lots!EP125)","v":""},{"$f":"IF(Lots!A125=\"\",\"\",Lots!EQ125)","v":""},{"$f":"IF(Lots!A125=\"\",\"\",Lots!ER125)","v":""},{"$f":"IF(Lots!A125=\"\",\"\",IF(Lots!ES125=TRUE,\"B\",\"S\"))","v":""}]
[{"$f":"IF(Lots!A126=\"\",\"\",Lots!A126)","v":""},{"$f":"IF(Lots!A126=\"\",\"\",Lots!F126)","v":""},{"$f":"IF(Lots!A126=\"\",\"\",Lots!J126)","v":""},{"$f":"IF(Lots!A126=\"\",\"\",Lots!G126)","v":""},{"$f":"IF(Lots!A126=\"\",\"\",Lots!H126)","v":""},{"$f":"IF(Lots!A126=\"\",\"\",Lots!EA126)","v":""},{"$f":"IF(Lots!A126=\"\",\"\",Lots!EB126)","v":""},{"$f":"IF(Lots!A126=\"\",\"\",Lots!EK126)","v":""},{"$f":"IF(Lots!A126=\"\",\"\",Lots!EF126)","v":""},{"$f":"IF(Lots!F126=\"\",\"\",Lots!EG126)","v":""},{"$f":"IF(Lots!H126=\"\",\"\",Lots!EH126)","v":""},"",{"$f":"IF(A137=\"\",\"\",IF(Lots!ET126=TRUE,\"D\",\"S\"))","v":""},0,0,0,{"$f":"IF(Lots!A126=\"\",\"\",Lots!EM126)","v":""},{"$f":"IF(Lots!A126=\"\",\"\",Lots!EN126)","v":""},{"$f":"IF(Lots!A126=\"\",\"\",Lots!EO126)","v":""},{"$f":"IF(Lots!A126=\"\",\"\",Lots!EP126)","v":""},{"$f":"IF(Lots!A126=\"\",\"\",Lots!EQ126)","v":""},{"$f":"IF(Lots!A126=\"\",\"\",Lots!ER126)","v":""},{"$f":"IF(Lots!A126=\"\",\"\",IF(Lots!ES126=TRUE,\"B\",\"S\"))","v":""}]
[{"$f":"IF(Lots!A127=\"\",\"\",Lots!A127)","v":""},{"$f":"IF(Lots!A127=\"\",\"\",Lots!F127)","v":""},{"$f":"IF(Lots!A127=\"\",\"\",Lots!J127)","v":""},{"$f":"IF(Lots!A127=\"\",\"\",Lots!G127)","v":""},{"$f":"IF(Lots!A127=\"\",\"\",Lots!H127)","v":""},{"$f":"IF(Lots!A127=\"\",\"\",Lots!EA127)","v":""},{"$f":"IF(Lots!A127=\"\",\"\",Lots!EB127)","v":""},{"$f":"IF(Lots!A127=\"\",\"\",Lots!EK127)","v":""},{"$f":"IF(Lots!A127=\"\",\"\",Lots!EF127)","v":""},{"$f":"IF(Lots!F127=\"\",\"\",Lots!EG127)","v":""},{"$f":"IF(Lots!H127=\"\",\"\",Lots!EH127)","v":""},"",{"$f":"IF(A138=\"\",\"\",IF(Lots!ET127=TRUE,\"D\",\"S\"))","v":""},0,0,0,{"$f":"IF(Lots!A127=\"\",\"\",Lots!EM127)","v":""},{"$f":"IF(Lots!A127=\"\",\"\",Lots!EN127)","v":""},{"$f":"IF(Lots!A127=\"\",\"\",Lots!EO127)","v":""},{"$f":"IF(Lots!A127=\"\",\"\",Lots!EP127)","v":""},{"$f":"IF(Lots!A127=\"\",\"\",Lots!EQ127)","v":""},{"$f":"IF(Lots!A127=\"\",\"\",Lots!ER127)","v":""},{"$f":"IF(Lots!A127=\"\",\"\",IF(Lots!ES127=TRUE,\"B\",\"S\"))","v":""}]
[{"$f":"IF(Lots!A128=\"\",\"\",Lots!A128)","v":""},{"$f":"IF(Lots!A128=\"\",\"\",Lots!F128)","v":""},{"$f":"IF(Lots!A128=\"\",\"\",Lots!J128)","v":""},{"$f":"IF(Lots!A128=\"\",\"\",Lots!G128)","v":""},{"$f":"IF(Lots!A128=\"\",\"\",Lots!H128)","v":""},{"$f":"IF(Lots!A128=\"\",\"\",Lots!EA128)","v":""},{"$f":"IF(Lots!A128=\"\",\"\",Lots!EB128)","v":""},{"$f":"IF(Lots!A128=\"\",\"\",Lots!EK128)","v":""},{"$f":"IF(Lots!A128=\"\",\"\",Lots!EF128)","v":""},{"$f":"IF(Lots!F128=\"\",\"\",Lots!EG128)","v":""},{"$f":"IF(Lots!H128=\"\",\"\",Lots!EH128)","v":""},"",{"$f":"IF(A139=\"\",\"\",IF(Lots!ET128=TRUE,\"D\",\"S\"))","v":""},0,0,0,{"$f":"IF(Lots!A128=\"\",\"\",Lots!EM128)","v":""},{"$f":"IF(Lots!A128=\"\",\"\",Lots!EN128)","v":""},{"$f":"IF(Lots!A128=\"\",\"\",Lots!EO128)","v":""},{"$f":"IF(Lots!A128=\"\",\"\",Lots!EP128)","v":""},{"$f":"IF(Lots!A128=\"\",\"\",Lots!EQ128)","v":""},{"$f":"IF(Lots!A128=\"\",\"\",Lots!ER128)","v":""},{"$f":"IF(Lots!A128=\"\",\"\",IF(Lots!ES128=TRUE,\"B\",\"S\"))","v":""}]
[{"$f":"IF(Lots!A129=\"\",\"\",Lots!A129)","v":""},{"$f":"IF(Lots!A129=\"\",\"\",Lots!F129)","v":""},{"$f":"IF(Lots!A129=\"\",\"\",Lots!J129)","v":""},{"$f":"IF(Lots!A129=\"\",\"\",Lots!G129)","v":""},{"$f":"IF(Lots!A129=\"\",\"\",Lots!H129)","v":""},{"$f":"IF(Lots!A129=\"\",\"\",Lots!EA129)","v":""},{"$f":"IF(Lots!A129=\"\",\"\",Lots!EB129)","v":""},{"$f":"IF(Lots!A129=\"\",\"\",Lots!EK129)","v":""},{"$f":"IF(Lots!A129=\"\",\"\",Lots!EF129)","v":""},{"$f":"IF(Lots!F129=\"\",\"\",Lots!EG129)","v":""},{"$f":"IF(Lots!H129=\"\",\"\",Lots!EH129)","v":""},"",{"$f":"IF(A140=\"\",\"\",IF(Lots!ET129=TRUE,\"D\",\"S\"))","v":""},0,0,0,{"$f":"IF(Lots!A129=\"\",\"\",Lots!EM129)","v":""},{"$f":"IF(Lots!A129=\"\",\"\",Lots!EN129)","v":""},{"$f":"IF(Lots!A129=\"\",\"\",Lots!EO129)","v":""},{"$f":"IF(Lots!A129=\"\",\"\",Lots!EP129)","v":""},{"$f":"IF(Lots!A129=\"\",\"\",Lots!EQ129)","v":""},{"$f":"IF(Lots!A129=\"\",\"\",Lots!ER129)","v":""},{"$f":"IF(Lots!A129=\"\",\"\",IF(Lots!ES129=TRUE,\"B\",\"S\"))","v":""}]
[{"$f":"IF(Lots!A130=\"\",\"\",Lots!A130)","v":""},{"$f":"IF(Lots!A130=\"\",\"\",Lots!F130)","v":""},{"$f":"IF(Lots!A130=\"\",\"\",Lots!J130)","v":""},{"$f":"IF(Lots!A130=\"\",\"\",Lots!G130)","v":""},{"$f":"IF(Lots!A130=\"\",\"\",Lots!H130)","v":""},{"$f":"IF(Lots!A130=\"\",\"\",Lots!EA130)","v":""},{"$f":"IF(Lots!A130=\"\",\"\",Lots!EB130)","v":""},{"$f":"IF(Lots!A130=\"\",\"\",Lots!EK130)","v":""},{"$f":"IF(Lots!A130=\"\",\"\",Lots!EF130)","v":""},{"$f":"IF(Lots!F130=\"\",\"\",Lots!EG130)","v":""},{"$f":"IF(Lots!H130=\"\",\"\",Lots!EH130)","v":""},"",{"$f":"IF(A141=\"\",\"\",IF(Lots!ET130=TRUE,\"D\",\"S\"))","v":""},0,0,0,{"$f":"IF(Lots!A130=\"\",\"\",Lots!EM130)","v":""},{"$f":"IF(Lots!A130=\"\",\"\",Lots!EN130)","v":""},{"$f":"IF(Lots!A130=\"\",\"\",Lots!EO130)","v":""},{"$f":"IF(Lots!A130=\"\",\"\",Lots!EP130)","v":""},{"$f":"IF(Lots!A130=\"\",\"\",Lots!EQ130)","v":""},{"$f":"IF(Lots!A130=\"\",\"\",Lots!ER130)","v":""},{"$f":"IF(Lots!A130=\"\",\"\",IF(Lots!ES130=TRUE,\"B\",\"S\"))","v":""}]
[{"$f":"IF(Lots!A131=\"\",\"\",Lots!A131)","v":""},{"$f":"IF(Lots!A131=\"\",\"\",Lots!F131)","v":""},{"$f":"IF(Lots!A131=\"\",\"\",Lots!J131)","v":""},{"$f":"IF(Lots!A131=\"\",\"\",Lots!G131)","v":""},{"$f":"IF(Lots!A131=\"\",\"\",Lots!H131)","v":""},{"$f":"IF(Lots!A131=\"\",\"\",Lots!EA131)","v":""},{"$f":"IF(Lots!A131=\"\",\"\",Lots!EB131)","v":""},{"$f":"IF(Lots!A131=\"\",\"\",Lots!EK131)","v":""},{"$f":"IF(Lots!A131=\"\",\"\",Lots!EF131)","v":""},{"$f":"IF(Lots!F131=\"\",\"\",Lots!EG131)","v":""},{"$f":"IF(Lots!H131=\"\",\"\",Lots!EH131)","v":""},{"$f":"IF(A142=\"\",\"\",SUM(J142:K142))","v":""},{"$f":"IF(A142=\"\",\"\",IF(Lots!ET131=TRUE,\"D\",\"S\"))","v":""},0,0,0,{"$f":"IF(Lots!A131=\"\",\"\",Lots!EM131)","v":""},{"$f":"IF(Lots!A131=\"\",\"\",Lots!EN131)","v":""},{"$f":"IF(Lots!A131=\"\",\"\",Lots!EO131)","v":""},{"$f":"IF(Lots!A131=\"\",\"\",Lots!EP131)","v":""},{"$f":"IF(Lots!A131=\"\",\"\",Lots!EQ131)","v":""},{"$f":"IF(Lots!A131=\"\",\"\",Lots!ER131)","v":""},{"$f":"IF(Lots!A131=\"\",\"\",IF(Lots!ES131=TRUE,\"B\",\"S\"))","v":""}]
[{"$f":"IF(Lots!A132=\"\",\"\",Lots!A132)","v":""},{"$f":"IF(Lots!A132=\"\",\"\",Lots!F132)","v":""},{"$f":"IF(Lots!A132=\"\",\"\",Lots!J132)","v":""},{"$f":"IF(Lots!A132=\"\",\"\",Lots!G132)","v":""},{"$f":"IF(Lots!A132=\"\",\"\",Lots!H132)","v":""},{"$f":"IF(Lots!A132=\"\",\"\",Lots!EA132)","v":""},{"$f":"IF(Lots!A132=\"\",\"\",Lots!EB132)","v":""},{"$f":"IF(Lots!A132=\"\",\"\",Lots!EK132)","v":""},{"$f":"IF(Lots!A132=\"\",\"\",Lots!EF132)","v":""},{"$f":"IF(Lots!F132=\"\",\"\",Lots!EG132)","v":""},{"$f":"IF(Lots!H132=\"\",\"\",Lots!EH132)","v":""},"",{"$f":"IF(A143=\"\",\"\",IF(Lots!ET132=TRUE,\"D\",\"S\"))","v":""},0,0,0,{"$f":"IF(Lots!A132=\"\",\"\",Lots!EM132)","v":""},{"$f":"IF(Lots!A132=\"\",\"\",Lots!EN132)","v":""},{"$f":"IF(Lots!A132=\"\",\"\",Lots!EO132)","v":""},{"$f":"IF(Lots!A132=\"\",\"\",Lots!EP132)","v":""},{"$f":"IF(Lots!A132=\"\",\"\",Lots!EQ132)","v":""},{"$f":"IF(Lots!A132=\"\",\"\",Lots!ER132)","v":""},{"$f":"IF(Lots!A132=\"\",\"\",IF(Lots!ES132=TRUE,\"B\",\"S\"))","v":""}]
[{"$f":"IF(Lots!A133=\"\",\"\",Lots!A133)","v":""},{"$f":"IF(Lots!A133=\"\",\"\",Lots!F133)","v":""},{"$f":"IF(Lots!A133=\"\",\"\",Lots!J133)","v":""},{"$f":"IF(Lots!A133=\"\",\"\",Lots!G133)","v":""},{"$f":"IF(Lots!A133=\"\",\"\",Lots!H133)","v":""},{"$f":"IF(Lots!A133=\"\",\"\",Lots!EA133)","v":""},{"$f":"IF(Lots!A133=\"\",\"\",Lots!EB133)","v":""},{"$f":"IF(Lots!A133=\"\",\"\",Lots!EK133)","v":""},{"$f":"IF(Lots!A133=\"\",\"\",Lots!EF133)","v":""},{"$f":"IF(Lots!F133=\"\",\"\",Lots!EG133)","v":""},{"$f":"IF(Lots!H133=\"\",\"\",Lots!EH133)","v":""},"",{"$f":"IF(A144=\"\",\"\",IF(Lots!ET133=TRUE,\"D\",\"S\"))","v":""},0,0,0,{"$f":"IF(Lots!A133=\"\",\"\",Lots!EM133)","v":""},{"$f":"IF(Lots!A133=\"\",\"\",Lots!EN133)","v":""},{"$f":"IF(Lots!A133=\"\",\"\",Lots!EO133)","v":""},{"$f":"IF(Lots!A133=\"\",\"\",Lots!EP133)","v":""},{"$f":"IF(Lots!A133=\"\",\"\",Lots!EQ133)","v":""},{"$f":"IF(Lots!A133=\"\",\"\",Lots!ER133)","v":""},{"$f":"IF(Lots!A133=\"\",\"\",IF(Lots!ES133=TRUE,\"B\",\"S\"))","v":""}]
[{"$f":"IF(Lots!A134=\"\",\"\",Lots!A134)","v":""},{"$f":"IF(Lots!A134=\"\",\"\",Lots!F134)","v":""},{"$f":"IF(Lots!A134=\"\",\"\",Lots!J134)","v":""},{"$f":"IF(Lots!A134=\"\",\"\",Lots!G134)","v":""},{"$f":"IF(Lots!A134=\"\",\"\",Lots!H134)","v":""},{"$f":"IF(Lots!A134=\"\",\"\",Lots!EA134)","v":""},{"$f":"IF(Lots!A134=\"\",\"\",Lots!EB134)","v":""},{"$f":"IF(Lots!A134=\"\",\"\",Lots!EK134)","v":""},{"$f":"IF(Lots!A134=\"\",\"\",Lots!EF134)","v":""},{"$f":"IF(Lots!F134=\"\",\"\",Lots!EG134)","v":""},{"$f":"IF(Lots!H134=\"\",\"\",Lots!EH134)","v":""},"",{"$f":"IF(A145=\"\",\"\",IF(Lots!ET134=TRUE,\"D\",\"S\"))","v":""},0,0,0,{"$f":"IF(Lots!A134=\"\",\"\",Lots!EM134)","v":""},{"$f":"IF(Lots!A134=\"\",\"\",Lots!EN134)","v":""},{"$f":"IF(Lots!A134=\"\",\"\",Lots!EO134)","v":""},{"$f":"IF(Lots!A134=\"\",\"\",Lots!EP134)","v":""},{"$f":"IF(Lots!A134=\"\",\"\",Lots!EQ134)","v":""},{"$f":"IF(Lots!A134=\"\",\"\",Lots!ER134)","v":""},{"$f":"IF(Lots!A134=\"\",\"\",IF(Lots!ES134=TRUE,\"B\",\"S\"))","v":""}]
[{"$f":"IF(Lots!A135=\"\",\"\",Lots!A135)","v":""},{"$f":"IF(Lots!A135=\"\",\"\",Lots!F135)","v":""},{"$f":"IF(Lots!A135=\"\",\"\",Lots!J135)","v":""},{"$f":"IF(Lots!A135=\"\",\"\",Lots!G135)","v":""},{"$f":"IF(Lots!A135=\"\",\"\",Lots!H135)","v":""},{"$f":"IF(Lots!A135=\"\",\"\",Lots!EA135)","v":""},{"$f":"IF(Lots!A135=\"\",\"\",Lots!EB135)","v":""},{"$f":"IF(Lots!A135=\"\",\"\",Lots!EK135)","v":""},{"$f":"IF(Lots!A135=\"\",\"\",Lots!EF135)","v":""},{"$f":"IF(Lots!F135=\"\",\"\",Lots!EG135)","v":""},{"$f":"IF(Lots!H135=\"\",\"\",Lots!EH135)","v":""},"",{"$f":"IF(A146=\"\",\"\",IF(Lots!ET135=TRUE,\"D\",\"S\"))","v":""},0,0,0,{"$f":"IF(Lots!A135=\"\",\"\",Lots!EM135)","v":""},{"$f":"IF(Lots!A135=\"\",\"\",Lots!EN135)","v":""},{"$f":"IF(Lots!A135=\"\",\"\",Lots!EO135)","v":""},{"$f":"IF(Lots!A135=\"\",\"\",Lots!EP135)","v":""},{"$f":"IF(Lots!A135=\"\",\"\",Lots!EQ135)","v":""},{"$f":"IF(Lots!A135=\"\",\"\",Lots!ER135)","v":""},{"$f":"IF(Lots!A135=\"\",\"\",IF(Lots!ES135=TRUE,\"B\",\"S\"))","v":""}]
[{"$f":"IF(Lots!A136=\"\",\"\",Lots!A136)","v":""},{"$f":"IF(Lots!A136=\"\",\"\",Lots!F136)","v":""},{"$f":"IF(Lots!A136=\"\",\"\",Lots!J136)","v":""},{"$f":"IF(Lots!A136=\"\",\"\",Lots!G136)","v":""},{"$f":"IF(Lots!A136=\"\",\"\",Lots!H136)","v":""},{"$f":"IF(Lots!A136=\"\",\"\",Lots!EA136)","v":""},{"$f":"IF(Lots!A136=\"\",\"\",Lots!EB136)","v":""},{"$f":"IF(Lots!A136=\"\",\"\",Lots!EK136)","v":""},{"$f":"IF(Lots!A136=\"\",\"\",Lots!EF136)","v":""},{"$f":"IF(Lots!F136=\"\",\"\",Lots!EG136)","v":""},{"$f":"IF(Lots!H136=\"\",\"\",Lots!EH136)","v":""},"",{"$f":"IF(A147=\"\",\"\",IF(Lots!ET136=TRUE,\"D\",\"S\"))","v":""},0,0,0,{"$f":"IF(Lots!A136=\"\",\"\",Lots!EM136)","v":""},{"$f":"IF(Lots!A136=\"\",\"\",Lots!EN136)","v":""},{"$f":"IF(Lots!A136=\"\",\"\",Lots!EO136)","v":""},{"$f":"IF(Lots!A136=\"\",\"\",Lots!EP136)","v":""},{"$f":"IF(Lots!A136=\"\",\"\",Lots!EQ136)","v":""},{"$f":"IF(Lots!A136=\"\",\"\",Lots!ER136)","v":""},{"$f":"IF(Lots!A136=\"\",\"\",IF(Lots!ES136=TRUE,\"B\",\"S\"))","v":""}]
[{"$f":"IF(Lots!A137=\"\",\"\",Lots!A137)","v":""},{"$f":"IF(Lots!A137=\"\",\"\",Lots!F137)","v":""},{"$f":"IF(Lots!A137=\"\",\"\",Lots!J137)","v":""},{"$f":"IF(Lots!A137=\"\",\"\",Lots!G137)","v":""},{"$f":"IF(Lots!A137=\"\",\"\",Lots!H137)","v":""},{"$f":"IF(Lots!A137=\"\",\"\",Lots!EA137)","v":""},{"$f":"IF(Lots!A137=\"\",\"\",Lots!EB137)","v":""},{"$f":"IF(Lots!A137=\"\",\"\",Lots!EK137)","v":""},{"$f":"IF(Lots!A137=\"\",\"\",Lots!EF137)","v":""},{"$f":"IF(Lots!F137=\"\",\"\",Lots!EG137)","v":""},{"$f":"IF(Lots!H137=\"\",\"\",Lots!EH137)","v":""},"",{"$f":"IF(A148=\"\",\"\",IF(Lots!ET137=TRUE,\"D\",\"S\"))","v":""},0,0,0,{"$f":"IF(Lots!A137=\"\",\"\",Lots!EM137)","v":""},{"$f":"IF(Lots!A137=\"\",\"\",Lots!EN137)","v":""},{"$f":"IF(Lots!A137=\"\",\"\",Lots!EO137)","v":""},{"$f":"IF(Lots!A137=\"\",\"\",Lots!EP137)","v":""},{"$f":"IF(Lots!A137=\"\",\"\",Lots!EQ137)","v":""},{"$f":"IF(Lots!A137=\"\",\"\",Lots!ER137)","v":""},{"$f":"IF(Lots!A137=\"\",\"\",IF(Lots!ES137=TRUE,\"B\",\"S\"))","v":""}]
[{"$f":"IF(Lots!A138=\"\",\"\",Lots!A138)","v":""},{"$f":"IF(Lots!A138=\"\",\"\",Lots!F138)","v":""},{"$f":"IF(Lots!A138=\"\",\"\",Lots!J138)","v":""},{"$f":"IF(Lots!A138=\"\",\"\",Lots!G138)","v":""},{"$f":"IF(Lots!A138=\"\",\"\",Lots!H138)","v":""},{"$f":"IF(Lots!A138=\"\",\"\",Lots!EA138)","v":""},{"$f":"IF(Lots!A138=\"\",\"\",Lots!EB138)","v":""},{"$f":"IF(Lots!A138=\"\",\"\",Lots!EK138)","v":""},{"$f":"IF(Lots!A138=\"\",\"\",Lots!EF138)","v":""},{"$f":"IF(Lots!F138=\"\",\"\",Lots!EG138)","v":""},{"$f":"IF(Lots!H138=\"\",\"\",Lots!EH138)","v":""},"",{"$f":"IF(A149=\"\",\"\",IF(Lots!ET138=TRUE,\"D\",\"S\"))","v":""},0,0,0,{"$f":"IF(Lots!A138=\"\",\"\",Lots!EM138)","v":""},{"$f":"IF(Lots!A138=\"\",\"\",Lots!EN138)","v":""},{"$f":"IF(Lots!A138=\"\",\"\",Lots!EO138)","v":""},{"$f":"IF(Lots!A138=\"\",\"\",Lots!EP138)","v":""},{"$f":"IF(Lots!A138=\"\",\"\",Lots!EQ138)","v":""},{"$f":"IF(Lots!A138=\"\",\"\",Lots!ER138)","v":""},{"$f":"IF(Lots!A138=\"\",\"\",IF(Lots!ES138=TRUE,\"B\",\"S\"))","v":""}]
[{"$f":"IF(Lots!A139=\"\",\"\",Lots!A139)","v":""},{"$f":"IF(Lots!A139=\"\",\"\",Lots!F139)","v":""},{"$f":"IF(Lots!A139=\"\",\"\",Lots!J139)","v":""},{"$f":"IF(Lots!A139=\"\",\"\",Lots!G139)","v":""},{"$f":"IF(Lots!A139=\"\",\"\",Lots!H139)","v":""},{"$f":"IF(Lots!A139=\"\",\"\",Lots!EA139)","v":""},{"$f":"IF(Lots!A139=\"\",\"\",Lots!EB139)","v":""},{"$f":"IF(Lots!A139=\"\",\"\",Lots!EK139)","v":""},{"$f":"IF(Lots!A139=\"\",\"\",Lots!EF139)","v":""},{"$f":"IF(Lots!F139=\"\",\"\",Lots!EG139)","v":""},{"$f":"IF(Lots!H139=\"\",\"\",Lots!EH139)","v":""},"",{"$f":"IF(A150=\"\",\"\",IF(Lots!ET139=TRUE,\"D\",\"S\"))","v":""},0,0,0,{"$f":"IF(Lots!A139=\"\",\"\",Lots!EM139)","v":""},{"$f":"IF(Lots!A139=\"\",\"\",Lots!EN139)","v":""},{"$f":"IF(Lots!A139=\"\",\"\",Lots!EO139)","v":""},{"$f":"IF(Lots!A139=\"\",\"\",Lots!EP139)","v":""},{"$f":"IF(Lots!A139=\"\",\"\",Lots!EQ139)","v":""},{"$f":"IF(Lots!A139=\"\",\"\",Lots!ER139)","v":""},{"$f":"IF(Lots!A139=\"\",\"\",IF(Lots!ES139=TRUE,\"B\",\"S\"))","v":""}]
[{"$f":"IF(Lots!A140=\"\",\"\",Lots!A140)","v":""},{"$f":"IF(Lots!A140=\"\",\"\",Lots!F140)","v":""},{"$f":"IF(Lots!A140=\"\",\"\",Lots!J140)","v":""},{"$f":"IF(Lots!A140=\"\",\"\",Lots!G140)","v":""},{"$f":"IF(Lots!A140=\"\",\"\",Lots!H140)","v":""},{"$f":"IF(Lots!A140=\"\",\"\",Lots!EA140)","v":""},{"$f":"IF(Lots!A140=\"\",\"\",Lots!EB140)","v":""},{"$f":"IF(Lots!A140=\"\",\"\",Lots!EK140)","v":""},{"$f":"IF(Lots!A140=\"\",\"\",Lots!EF140)","v":""},{"$f":"IF(Lots!F140=\"\",\"\",Lots!EG140)","v":""},{"$f":"IF(Lots!H140=\"\",\"\",Lots!EH140)","v":""},{"$f":"IF(A151=\"\",\"\",SUM(J151:K151))","v":""},{"$f":"IF(A151=\"\",\"\",IF(Lots!ET140=TRUE,\"D\",\"S\"))","v":""},{"$f":"IF(A151=\"\",0,$A$8/100*D151*B151)","v":0},{"$f":"IF(A151=\"\",0,$A$8/100*E151*C151)","v":0},{"$f":"IF(I151>50,0,L151)","v":0},{"$f":"IF(Lots!A140=\"\",\"\",Lots!EM140)","v":""},{"$f":"IF(Lots!A140=\"\",\"\",Lots!EN140)","v":""},{"$f":"IF(Lots!A140=\"\",\"\",Lots!EO140)","v":""},{"$f":"IF(Lots!A140=\"\",\"\",Lots!EP140)","v":""},{"$f":"IF(Lots!A140=\"\",\"\",Lots!EQ140)","v":""},{"$f":"IF(Lots!A140=\"\",\"\",Lots!ER140)","v":""}]
[{"$f":"IF(Lots!A141=\"\",\"\",Lots!A141)","v":""},{"$f":"IF(Lots!A141=\"\",\"\",Lots!F141)","v":""},{"$f":"IF(Lots!A141=\"\",\"\",Lots!J141)","v":""},{"$f":"IF(Lots!A141=\"\",\"\",Lots!G141)","v":""},{"$f":"IF(Lots!A141=\"\",\"\",Lots!H141)","v":""},{"$f":"IF(Lots!A141=\"\",\"\",Lots!EA141)","v":""},{"$f":"IF(Lots!A141=\"\",\"\",Lots!EB141)","v":""},{"$f":"IF(Lots!A141=\"\",\"\",Lots!EK141)","v":""},{"$f":"IF(Lots!A141=\"\",\"\",Lots!EF141)","v":""},{"$f":"IF(Lots!F141=\"\",\"\",Lots!EG141)","v":""},{"$f":"IF(Lots!H141=\"\",\"\",Lots!EH141)","v":""},{"$f":"IF(A152=\"\",\"\",SUM(J152:K152))","v":""},{"$f":"IF(A152=\"\",\"\",IF(Lots!ET141=TRUE,\"D\",\"S\"))","v":""},{"$f":"IF(A152=\"\",0,$A$8/100*D152*B152)","v":0},{"$f":"IF(A152=\"\",0,$A$8/100*E152*C152)","v":0},{"$f":"IF(I152>50,0,L152)","v":0},{"$f":"IF(Lots!A141=\"\",\"\",Lots!EM141)","v":""},{"$f":"IF(Lots!A141=\"\",\"\",Lots!EN141)","v":""},{"$f":"IF(Lots!A141=\"\",\"\",Lots!EO141)","v":""},{"$f":"IF(Lots!A141=\"\",\"\",Lots!EP141)","v":""},{"$f":"IF(Lots!A141=\"\",\"\",Lots!EQ141)","v":""},{"$f":"IF(Lots!A141=\"\",\"\",Lots!ER141)","v":""}]
[{"$f":"IF(Lots!A142=\"\",\"\",Lots!A142)","v":""},{"$f":"IF(Lots!A142=\"\",\"\",Lots!F142)","v":""},{"$f":"IF(Lots!A142=\"\",\"\",Lots!J142)","v":""},{"$f":"IF(Lots!A142=\"\",\"\",Lots!G142)","v":""},{"$f":"IF(Lots!A142=\"\",\"\",Lots!H142)","v":""},{"$f":"IF(Lots!A142=\"\",\"\",Lots!EA142)","v":""},{"$f":"IF(Lots!A142=\"\",\"\",Lots!EB142)","v":""},{"$f":"IF(Lots!A142=\"\",\"\",Lots!EK142)","v":""},{"$f":"IF(Lots!A142=\"\",\"\",Lots!EF142)","v":""},{"$f":"IF(Lots!F142=\"\",\"\",Lots!EG142)","v":""},{"$f":"IF(Lots!H142=\"\",\"\",Lots!EH142)","v":""},{"$f":"IF(A153=\"\",\"\",SUM(J153:K153))","v":""},{"$f":"IF(A153=\"\",\"\",IF(Lots!ET142=TRUE,\"D\",\"S\"))","v":""},{"$f":"IF(A153=\"\",0,$A$8/100*D153*B153)","v":0},{"$f":"IF(A153=\"\",0,$A$8/100*E153*C153)","v":0},{"$f":"IF(I153>50,0,L153)","v":0},{"$f":"IF(Lots!A142=\"\",\"\",Lots!EM142)","v":""},{"$f":"IF(Lots!A142=\"\",\"\",Lots!EN142)","v":""},{"$f":"IF(Lots!A142=\"\",\"\",Lots!EO142)","v":""},{"$f":"IF(Lots!A142=\"\",\"\",Lots!EP142)","v":""},{"$f":"IF(Lots!A142=\"\",\"\",Lots!EQ142)","v":""},{"$f":"IF(Lots!A142=\"\",\"\",Lots!ER142)","v":""}]
[{"$f":"IF(Lots!A143=\"\",\"\",Lots!A143)","v":""},{"$f":"IF(Lots!A143=\"\",\"\",Lots!F143)","v":""},{"$f":"IF(Lots!A143=\"\",\"\",Lots!J143)","v":""},{"$f":"IF(Lots!A143=\"\",\"\",Lots!G143)","v":""},{"$f":"IF(Lots!A143=\"\",\"\",Lots!H143)","v":""},{"$f":"IF(Lots!A143=\"\",\"\",Lots!EA143)","v":""},{"$f":"IF(Lots!A143=\"\",\"\",Lots!EB143)","v":""},{"$f":"IF(Lots!A143=\"\",\"\",Lots!EK143)","v":""},{"$f":"IF(Lots!A143=\"\",\"\",Lots!EF143)","v":""},{"$f":"IF(Lots!F143=\"\",\"\",Lots!EG143)","v":""},{"$f":"IF(Lots!H143=\"\",\"\",Lots!EH143)","v":""},{"$f":"IF(A154=\"\",\"\",SUM(J154:K154))","v":""},{"$f":"IF(A154=\"\",\"\",IF(Lots!ET143=TRUE,\"D\",\"S\"))","v":""},{"$f":"IF(A154=\"\",0,$A$8/100*D154*B154)","v":0},{"$f":"IF(A154=\"\",0,$A$8/100*E154*C154)","v":0},{"$f":"IF(I154>50,0,L154)","v":0},{"$f":"IF(Lots!A143=\"\",\"\",Lots!EM143)","v":""},{"$f":"IF(Lots!A143=\"\",\"\",Lots!EN143)","v":""},{"$f":"IF(Lots!A143=\"\",\"\",Lots!EO143)","v":""},{"$f":"IF(Lots!A143=\"\",\"\",Lots!EP143)","v":""},{"$f":"IF(Lots!A143=\"\",\"\",Lots!EQ143)","v":""},{"$f":"IF(Lots!A143=\"\",\"\",Lots!ER143)","v":""}]
[{"$f":"IF(Lots!A144=\"\",\"\",Lots!A144)","v":""},{"$f":"IF(Lots!A144=\"\",\"\",Lots!F144)","v":""},{"$f":"IF(Lots!A144=\"\",\"\",Lots!J144)","v":""},{"$f":"IF(Lots!A144=\"\",\"\",Lots!G144)","v":""},{"$f":"IF(Lots!A144=\"\",\"\",Lots!H144)","v":""},{"$f":"IF(Lots!A144=\"\",\"\",Lots!EA144)","v":""},{"$f":"IF(Lots!A144=\"\",\"\",Lots!EB144)","v":""},{"$f":"IF(Lots!A144=\"\",\"\",Lots!EK144)","v":""},{"$f":"IF(Lots!A144=\"\",\"\",Lots!EF144)","v":""},{"$f":"IF(Lots!F144=\"\",\"\",Lots!EG144)","v":""},{"$f":"IF(Lots!H144=\"\",\"\",Lots!EH144)","v":""},"",{"$f":"IF(A155=\"\",\"\",IF(Lots!ET144=TRUE,\"D\",\"S\"))","v":""},0,0,0,{"$f":"IF(Lots!A144=\"\",\"\",Lots!EM144)","v":""},{"$f":"IF(Lots!A144=\"\",\"\",Lots!EN144)","v":""},{"$f":"IF(Lots!A144=\"\",\"\",Lots!EO144)","v":""},{"$f":"IF(Lots!A144=\"\",\"\",Lots!EP144)","v":""},{"$f":"IF(Lots!A144=\"\",\"\",Lots!EQ144)","v":""},{"$f":"IF(Lots!A144=\"\",\"\",Lots!ER144)","v":""}]
[{"$f":"IF(Lots!A145=\"\",\"\",Lots!A145)","v":""},{"$f":"IF(Lots!A145=\"\",\"\",Lots!F145)","v":""},{"$f":"IF(Lots!A145=\"\",\"\",Lots!J145)","v":""},{"$f":"IF(Lots!A145=\"\",\"\",Lots!G145)","v":""},{"$f":"IF(Lots!A145=\"\",\"\",Lots!H145)","v":""},{"$f":"IF(Lots!A145=\"\",\"\",Lots!EA145)","v":""},{"$f":"IF(Lots!A145=\"\",\"\",Lots!EB145)","v":""},{"$f":"IF(Lots!A145=\"\",\"\",Lots!EK145)","v":""},{"$f":"IF(Lots!A145=\"\",\"\",Lots!EF145)","v":""},{"$f":"IF(Lots!F145=\"\",\"\",Lots!EG145)","v":""},{"$f":"IF(Lots!H145=\"\",\"\",Lots!EH145)","v":""},"",{"$f":"IF(A156=\"\",\"\",IF(Lots!ET145=TRUE,\"D\",\"S\"))","v":""},0,0,0,{"$f":"IF(Lots!A145=\"\",\"\",Lots!EM145)","v":""},{"$f":"IF(Lots!A145=\"\",\"\",Lots!EN145)","v":""},{"$f":"IF(Lots!A145=\"\",\"\",Lots!EO145)","v":""},{"$f":"IF(Lots!A145=\"\",\"\",Lots!EP145)","v":""},{"$f":"IF(Lots!A145=\"\",\"\",Lots!EQ145)","v":""},{"$f":"IF(Lots!A145=\"\",\"\",Lots!ER145)","v":""}]
[{"$f":"IF(Lots!A146=\"\",\"\",Lots!A146)","v":""},{"$f":"IF(Lots!A146=\"\",\"\",Lots!F146)","v":""},{"$f":"IF(Lots!A146=\"\",\"\",Lots!J146)","v":""},{"$f":"IF(Lots!A146=\"\",\"\",Lots!G146)","v":""},{"$f":"IF(Lots!A146=\"\",\"\",Lots!H146)","v":""},{"$f":"IF(Lots!A146=\"\",\"\",Lots!EA146)","v":""},{"$f":"IF(Lots!A146=\"\",\"\",Lots!EB146)","v":""},{"$f":"IF(Lots!A146=\"\",\"\",Lots!EK146)","v":""},{"$f":"IF(Lots!A146=\"\",\"\",Lots!EF146)","v":""},{"$f":"IF(Lots!F146=\"\",\"\",Lots!EG146)","v":""},{"$f":"IF(Lots!H146=\"\",\"\",Lots!EH146)","v":""},"",{"$f":"IF(A157=\"\",\"\",IF(Lots!ET146=TRUE,\"D\",\"S\"))","v":""},0,0,0,{"$f":"IF(Lots!A146=\"\",\"\",Lots!EM146)","v":""},{"$f":"IF(Lots!A146=\"\",\"\",Lots!EN146)","v":""},{"$f":"IF(Lots!A146=\"\",\"\",Lots!EO146)","v":""},{"$f":"IF(Lots!A146=\"\",\"\",Lots!EP146)","v":""},{"$f":"IF(Lots!A146=\"\",\"\",Lots!EQ146)","v":""},{"$f":"IF(Lots!A146=\"\",\"\",Lots!ER146)","v":""}]
[{"$f":"IF(Lots!A147=\"\",\"\",Lots!A147)","v":""},{"$f":"IF(Lots!A147=\"\",\"\",Lots!F147)","v":""},{"$f":"IF(Lots!A147=\"\",\"\",Lots!J147)","v":""},{"$f":"IF(Lots!A147=\"\",\"\",Lots!G147)","v":""},{"$f":"IF(Lots!A147=\"\",\"\",Lots!H147)","v":""},{"$f":"IF(Lots!A147=\"\",\"\",Lots!EA147)","v":""},{"$f":"IF(Lots!A147=\"\",\"\",Lots!EB147)","v":""},{"$f":"IF(Lots!A147=\"\",\"\",Lots!EK147)","v":""},{"$f":"IF(Lots!A147=\"\",\"\",Lots!EF147)","v":""},{"$f":"IF(Lots!F147=\"\",\"\",Lots!EG147)","v":""},{"$f":"IF(Lots!H147=\"\",\"\",Lots!EH147)","v":""},"",{"$f":"IF(A158=\"\",\"\",IF(Lots!ET147=TRUE,\"D\",\"S\"))","v":""},0,0,0,{"$f":"IF(Lots!A147=\"\",\"\",Lots!EM147)","v":""},{"$f":"IF(Lots!A147=\"\",\"\",Lots!EN147)","v":""},{"$f":"IF(Lots!A147=\"\",\"\",Lots!EO147)","v":""},{"$f":"IF(Lots!A147=\"\",\"\",Lots!EP147)","v":""},{"$f":"IF(Lots!A147=\"\",\"\",Lots!EQ147)","v":""},{"$f":"IF(Lots!A147=\"\",\"\",Lots!ER147)","v":""}]
[{"$f":"IF(Lots!A148=\"\",\"\",Lots!A148)","v":""},{"$f":"IF(Lots!A148=\"\",\"\",Lots!F148)","v":""},{"$f":"IF(Lots!A148=\"\",\"\",Lots!J148)","v":""},{"$f":"IF(Lots!A148=\"\",\"\",Lots!G148)","v":""},{"$f":"IF(Lots!A148=\"\",\"\",Lots!H148)","v":""},{"$f":"IF(Lots!A148=\"\",\"\",Lots!EA148)","v":""},{"$f":"IF(Lots!A148=\"\",\"\",Lots!EB148)","v":""},{"$f":"IF(Lots!A148=\"\",\"\",Lots!EK148)","v":""},{"$f":"IF(Lots!A148=\"\",\"\",Lots!EF148)","v":""},{"$f":"IF(Lots!F148=\"\",\"\",Lots!EG148)","v":""},{"$f":"IF(Lots!H148=\"\",\"\",Lots!EH148)","v":""},"",{"$f":"IF(A159=\"\",\"\",IF(Lots!ET148=TRUE,\"D\",\"S\"))","v":""},0,0,0,{"$f":"IF(Lots!A148=\"\",\"\",Lots!EM148)","v":""},{"$f":"IF(Lots!A148=\"\",\"\",Lots!EN148)","v":""},{"$f":"IF(Lots!A148=\"\",\"\",Lots!EO148)","v":""},{"$f":"IF(Lots!A148=\"\",\"\",Lots!EP148)","v":""},{"$f":"IF(Lots!A148=\"\",\"\",Lots!EQ148)","v":""},{"$f":"IF(Lots!A148=\"\",\"\",Lots!ER148)","v":""}]
[{"$f":"IF(Lots!A149=\"\",\"\",Lots!A149)","v":""},{"$f":"IF(Lots!A149=\"\",\"\",Lots!F149)","v":""},{"$f":"IF(Lots!A149=\"\",\"\",Lots!J149)","v":""},{"$f":"IF(Lots!A149=\"\",\"\",Lots!G149)","v":""},{"$f":"IF(Lots!A149=\"\",\"\",Lots!H149)","v":""},{"$f":"IF(Lots!A149=\"\",\"\",Lots!EA149)","v":""},{"$f":"IF(Lots!A149=\"\",\"\",Lots!EB149)","v":""},{"$f":"IF(Lots!A149=\"\",\"\",Lots!EK149)","v":""},{"$f":"IF(Lots!A149=\"\",\"\",Lots!EF149)","v":""},{"$f":"IF(Lots!F149=\"\",\"\",Lots!EG149)","v":""},{"$f":"IF(Lots!H149=\"\",\"\",Lots!EH149)","v":""},"",{"$f":"IF(A160=\"\",\"\",IF(Lots!ET149=TRUE,\"D\",\"S\"))","v":""},0,0,0,{"$f":"IF(Lots!A149=\"\",\"\",Lots!EM149)","v":""},{"$f":"IF(Lots!A149=\"\",\"\",Lots!EN149)","v":""},{"$f":"IF(Lots!A149=\"\",\"\",Lots!EO149)","v":""},{"$f":"IF(Lots!A149=\"\",\"\",Lots!EP149)","v":""},{"$f":"IF(Lots!A149=\"\",\"\",Lots!EQ149)","v":""},{"$f":"IF(Lots!A149=\"\",\"\",Lots!ER149)","v":""}]
[{"$f":"IF(Lots!A150=\"\",\"\",Lots!A150)","v":""},{"$f":"IF(Lots!A150=\"\",\"\",Lots!F150)","v":""},{"$f":"IF(Lots!A150=\"\",\"\",Lots!J150)","v":""},{"$f":"IF(Lots!A150=\"\",\"\",Lots!G150)","v":""},{"$f":"IF(Lots!A150=\"\",\"\",Lots!H150)","v":""},{"$f":"IF(Lots!A150=\"\",\"\",Lots!EA150)","v":""},{"$f":"IF(Lots!A150=\"\",\"\",Lots!EB150)","v":""},{"$f":"IF(Lots!A150=\"\",\"\",Lots!EK150)","v":""},{"$f":"IF(Lots!A150=\"\",\"\",Lots!EF150)","v":""},{"$f":"IF(Lots!F150=\"\",\"\",Lots!EG150)","v":""},{"$f":"IF(Lots!H150=\"\",\"\",Lots!EH150)","v":""},"",{"$f":"IF(A161=\"\",\"\",IF(Lots!ET150=TRUE,\"D\",\"S\"))","v":""},0,0,0,{"$f":"IF(Lots!A150=\"\",\"\",Lots!EM150)","v":""},{"$f":"IF(Lots!A150=\"\",\"\",Lots!EN150)","v":""},{"$f":"IF(Lots!A150=\"\",\"\",Lots!EO150)","v":""},{"$f":"IF(Lots!A150=\"\",\"\",Lots!EP150)","v":""},{"$f":"IF(Lots!A150=\"\",\"\",Lots!EQ150)","v":""},{"$f":"IF(Lots!A150=\"\",\"\",Lots!ER150)","v":""}]
[{"$f":"IF(Lots!A151=\"\",\"\",Lots!A151)","v":""},{"$f":"IF(Lots!A151=\"\",\"\",Lots!F151)","v":""},{"$f":"IF(Lots!A151=\"\",\"\",Lots!J151)","v":""},{"$f":"IF(Lots!A151=\"\",\"\",Lots!G151)","v":""},{"$f":"IF(Lots!A151=\"\",\"\",Lots!H151)","v":""},{"$f":"IF(Lots!A151=\"\",\"\",Lots!EA151)","v":""},{"$f":"IF(Lots!A151=\"\",\"\",Lots!EB151)","v":""},{"$f":"IF(Lots!A151=\"\",\"\",Lots!EK151)","v":""},{"$f":"IF(Lots!A151=\"\",\"\",Lots!EF151)","v":""},{"$f":"IF(Lots!F151=\"\",\"\",Lots!EG151)","v":""},{"$f":"IF(Lots!H151=\"\",\"\",Lots!EH151)","v":""},"",{"$f":"IF(A162=\"\",\"\",IF(Lots!ET151=TRUE,\"D\",\"S\"))","v":""},0,0,0,{"$f":"IF(Lots!A151=\"\",\"\",Lots!EM151)","v":""},{"$f":"IF(Lots!A151=\"\",\"\",Lots!EN151)","v":""},{"$f":"IF(Lots!A151=\"\",\"\",Lots!EO151)","v":""},{"$f":"IF(Lots!A151=\"\",\"\",Lots!EP151)","v":""},{"$f":"IF(Lots!A151=\"\",\"\",Lots!EQ151)","v":""},{"$f":"IF(Lots!A151=\"\",\"\",Lots!ER151)","v":""}]
[{"$f":"IF(Lots!A152=\"\",\"\",Lots!A152)","v":""},{"$f":"IF(Lots!A152=\"\",\"\",Lots!F152)","v":""},{"$f":"IF(Lots!A152=\"\",\"\",Lots!J152)","v":""},{"$f":"IF(Lots!A152=\"\",\"\",Lots!G152)","v":""},{"$f":"IF(Lots!A152=\"\",\"\",Lots!H152)","v":""},{"$f":"IF(Lots!A152=\"\",\"\",Lots!EA152)","v":""},{"$f":"IF(Lots!A152=\"\",\"\",Lots!EB152)","v":""},{"$f":"IF(Lots!A152=\"\",\"\",Lots!EK152)","v":""},{"$f":"IF(Lots!A152=\"\",\"\",Lots!EF152)","v":""},{"$f":"IF(Lots!F152=\"\",\"\",Lots!EG152)","v":""},{"$f":"IF(Lots!H152=\"\",\"\",Lots!EH152)","v":""},"",{"$f":"IF(A163=\"\",\"\",IF(Lots!ET152=TRUE,\"D\",\"S\"))","v":""},0,0,0,{"$f":"IF(Lots!A152=\"\",\"\",Lots!EM152)","v":""},{"$f":"IF(Lots!A152=\"\",\"\",Lots!EN152)","v":""},{"$f":"IF(Lots!A152=\"\",\"\",Lots!EO152)","v":""},{"$f":"IF(Lots!A152=\"\",\"\",Lots!EP152)","v":""},{"$f":"IF(Lots!A152=\"\",\"\",Lots!EQ152)","v":""},{"$f":"IF(Lots!A152=\"\",\"\",Lots!ER152)","v":""}]
[{"$f":"IF(Lots!A153=\"\",\"\",Lots!A153)","v":""},{"$f":"IF(Lots!A153=\"\",\"\",Lots!F153)","v":""},{"$f":"IF(Lots!A153=\"\",\"\",Lots!J153)","v":""},{"$f":"IF(Lots!A153=\"\",\"\",Lots!G153)","v":""},{"$f":"IF(Lots!A153=\"\",\"\",Lots!H153)","v":""},{"$f":"IF(Lots!A153=\"\",\"\",Lots!EA153)","v":""},{"$f":"IF(Lots!A153=\"\",\"\",Lots!EB153)","v":""},{"$f":"IF(Lots!A153=\"\",\"\",Lots!EK153)","v":""},{"$f":"IF(Lots!A153=\"\",\"\",Lots!EF153)","v":""},{"$f":"IF(Lots!F153=\"\",\"\",Lots!EG153)","v":""},{"$f":"IF(Lots!H153=\"\",\"\",Lots!EH153)","v":""},"",{"$f":"IF(A164=\"\",\"\",IF(Lots!ET153=TRUE,\"D\",\"S\"))","v":""},0,0,0,{"$f":"IF(Lots!A153=\"\",\"\",Lots!EM153)","v":""},{"$f":"IF(Lots!A153=\"\",\"\",Lots!EN153)","v":""},{"$f":"IF(Lots!A153=\"\",\"\",Lots!EO153)","v":""},{"$f":"IF(Lots!A153=\"\",\"\",Lots!EP153)","v":""},{"$f":"IF(Lots!A153=\"\",\"\",Lots!EQ153)","v":""},{"$f":"IF(Lots!A153=\"\",\"\",Lots!ER153)","v":""}]
[{"$f":"IF(Lots!A154=\"\",\"\",Lots!A154)","v":""},{"$f":"IF(Lots!A154=\"\",\"\",Lots!F154)","v":""},{"$f":"IF(Lots!A154=\"\",\"\",Lots!J154)","v":""},{"$f":"IF(Lots!A154=\"\",\"\",Lots!G154)","v":""},{"$f":"IF(Lots!A154=\"\",\"\",Lots!H154)","v":""},{"$f":"IF(Lots!A154=\"\",\"\",Lots!EA154)","v":""},{"$f":"IF(Lots!A154=\"\",\"\",Lots!EB154)","v":""},{"$f":"IF(Lots!A154=\"\",\"\",Lots!EK154)","v":""},{"$f":"IF(Lots!A154=\"\",\"\",Lots!EF154)","v":""},{"$f":"IF(Lots!F154=\"\",\"\",Lots!EG154)","v":""},{"$f":"IF(Lots!H154=\"\",\"\",Lots!EH154)","v":""},"",{"$f":"IF(A165=\"\",\"\",IF(Lots!ET154=TRUE,\"D\",\"S\"))","v":""},0,0,0,{"$f":"IF(Lots!A154=\"\",\"\",Lots!EM154)","v":""},{"$f":"IF(Lots!A154=\"\",\"\",Lots!EN154)","v":""},{"$f":"IF(Lots!A154=\"\",\"\",Lots!EO154)","v":""},{"$f":"IF(Lots!A154=\"\",\"\",Lots!EP154)","v":""},{"$f":"IF(Lots!A154=\"\",\"\",Lots!EQ154)","v":""},{"$f":"IF(Lots!A154=\"\",\"\",Lots!ER154)","v":""}]
[{"$f":"IF(Lots!A155=\"\",\"\",Lots!A155)","v":""},{"$f":"IF(Lots!A155=\"\",\"\",Lots!F155)","v":""},{"$f":"IF(Lots!A155=\"\",\"\",Lots!J155)","v":""},{"$f":"IF(Lots!A155=\"\",\"\",Lots!G155)","v":""},{"$f":"IF(Lots!A155=\"\",\"\",Lots!H155)","v":""},{"$f":"IF(Lots!A155=\"\",\"\",Lots!EA155)","v":""},{"$f":"IF(Lots!A155=\"\",\"\",Lots!EB155)","v":""},{"$f":"IF(Lots!A155=\"\",\"\",Lots!EK155)","v":""},{"$f":"IF(Lots!A155=\"\",\"\",Lots!EF155)","v":""},{"$f":"IF(Lots!F155=\"\",\"\",Lots!EG155)","v":""},{"$f":"IF(Lots!H155=\"\",\"\",Lots!EH155)","v":""},"",{"$f":"IF(A166=\"\",\"\",IF(Lots!ET155=TRUE,\"D\",\"S\"))","v":""},0,0,0,{"$f":"IF(Lots!A155=\"\",\"\",Lots!EM155)","v":""},{"$f":"IF(Lots!A155=\"\",\"\",Lots!EN155)","v":""},{"$f":"IF(Lots!A155=\"\",\"\",Lots!EO155)","v":""},{"$f":"IF(Lots!A155=\"\",\"\",Lots!EP155)","v":""},{"$f":"IF(Lots!A155=\"\",\"\",Lots!EQ155)","v":""},{"$f":"IF(Lots!A155=\"\",\"\",Lots!ER155)","v":""}]
[{"$f":"IF(Lots!A156=\"\",\"\",Lots!A156)","v":""},{"$f":"IF(Lots!A156=\"\",\"\",Lots!F156)","v":""},{"$f":"IF(Lots!A156=\"\",\"\",Lots!J156)","v":""},{"$f":"IF(Lots!A156=\"\",\"\",Lots!G156)","v":""},{"$f":"IF(Lots!A156=\"\",\"\",Lots!H156)","v":""},{"$f":"IF(Lots!A156=\"\",\"\",Lots!EA156)","v":""},{"$f":"IF(Lots!A156=\"\",\"\",Lots!EB156)","v":""},{"$f":"IF(Lots!A156=\"\",\"\",Lots!EK156)","v":""},{"$f":"IF(Lots!A156=\"\",\"\",Lots!EF156)","v":""},{"$f":"IF(Lots!F156=\"\",\"\",Lots!EG156)","v":""},{"$f":"IF(Lots!H156=\"\",\"\",Lots!EH156)","v":""},"",{"$f":"IF(A167=\"\",\"\",IF(Lots!ET156=TRUE,\"D\",\"S\"))","v":""},0,0,0,{"$f":"IF(Lots!A156=\"\",\"\",Lots!EM156)","v":""},{"$f":"IF(Lots!A156=\"\",\"\",Lots!EN156)","v":""},{"$f":"IF(Lots!A156=\"\",\"\",Lots!EO156)","v":""},{"$f":"IF(Lots!A156=\"\",\"\",Lots!EP156)","v":""},{"$f":"IF(Lots!A156=\"\",\"\",Lots!EQ156)","v":""},{"$f":"IF(Lots!A156=\"\",\"\",Lots!ER156)","v":""}]
[{"$f":"IF(Lots!A157=\"\",\"\",Lots!A157)","v":""},{"$f":"IF(Lots!A157=\"\",\"\",Lots!F157)","v":""},{"$f":"IF(Lots!A157=\"\",\"\",Lots!J157)","v":""},{"$f":"IF(Lots!A157=\"\",\"\",Lots!G157)","v":""},{"$f":"IF(Lots!A157=\"\",\"\",Lots!H157)","v":""},{"$f":"IF(Lots!A157=\"\",\"\",Lots!EA157)","v":""},{"$f":"IF(Lots!A157=\"\",\"\",Lots!EB157)","v":""},{"$f":"IF(Lots!A157=\"\",\"\",Lots!EK157)","v":""},{"$f":"IF(Lots!A157=\"\",\"\",Lots!EF157)","v":""},{"$f":"IF(Lots!F157=\"\",\"\",Lots!EG157)","v":""},{"$f":"IF(Lots!H157=\"\",\"\",Lots!EH157)","v":""},"",{"$f":"IF(A168=\"\",\"\",IF(Lots!ET157=TRUE,\"D\",\"S\"))","v":""},0,0,0,{"$f":"IF(Lots!A157=\"\",\"\",Lots!EM157)","v":""},{"$f":"IF(Lots!A157=\"\",\"\",Lots!EN157)","v":""},{"$f":"IF(Lots!A157=\"\",\"\",Lots!EO157)","v":""},{"$f":"IF(Lots!A157=\"\",\"\",Lots!EP157)","v":""},{"$f":"IF(Lots!A157=\"\",\"\",Lots!EQ157)","v":""},{"$f":"IF(Lots!A157=\"\",\"\",Lots!ER157)","v":""}]
[{"$f":"IF(Lots!A158=\"\",\"\",Lots!A158)","v":""},{"$f":"IF(Lots!A158=\"\",\"\",Lots!F158)","v":""},{"$f":"IF(Lots!A158=\"\",\"\",Lots!J158)","v":""},{"$f":"IF(Lots!A158=\"\",\"\",Lots!G158)","v":""},{"$f":"IF(Lots!A158=\"\",\"\",Lots!H158)","v":""},{"$f":"IF(Lots!A158=\"\",\"\",Lots!EA158)","v":""},{"$f":"IF(Lots!A158=\"\",\"\",Lots!EB158)","v":""},{"$f":"IF(Lots!A158=\"\",\"\",Lots!EK158)","v":""},{"$f":"IF(Lots!A158=\"\",\"\",Lots!EF158)","v":""},{"$f":"IF(Lots!F158=\"\",\"\",Lots!EG158)","v":""},{"$f":"IF(Lots!H158=\"\",\"\",Lots!EH158)","v":""},"",{"$f":"IF(A169=\"\",\"\",IF(Lots!ET158=TRUE,\"D\",\"S\"))","v":""},0,0,0,{"$f":"IF(Lots!A158=\"\",\"\",Lots!EM158)","v":""},{"$f":"IF(Lots!A158=\"\",\"\",Lots!EN158)","v":""},{"$f":"IF(Lots!A158=\"\",\"\",Lots!EO158)","v":""},{"$f":"IF(Lots!A158=\"\",\"\",Lots!EP158)","v":""},{"$f":"IF(Lots!A158=\"\",\"\",Lots!EQ158)","v":""},{"$f":"IF(Lots!A158=\"\",\"\",Lots!ER158)","v":""}]
[{"$f":"IF(Lots!A159=\"\",\"\",Lots!A159)","v":""},{"$f":"IF(Lots!A159=\"\",\"\",Lots!F159)","v":""},{"$f":"IF(Lots!A159=\"\",\"\",Lots!J159)","v":""},{"$f":"IF(Lots!A159=\"\",\"\",Lots!G159)","v":""},{"$f":"IF(Lots!A159=\"\",\"\",Lots!H159)","v":""},{"$f":"IF(Lots!A159=\"\",\"\",Lots!EA159)","v":""},{"$f":"IF(Lots!A159=\"\",\"\",Lots!EB159)","v":""},{"$f":"IF(Lots!A159=\"\",\"\",Lots!EK159)","v":""},{"$f":"IF(Lots!A159=\"\",\"\",Lots!EF159)","v":""},{"$f":"IF(Lots!F159=\"\",\"\",Lots!EG159)","v":""},{"$f":"IF(Lots!H159=\"\",\"\",Lots!EH159)","v":""},"",{"$f":"IF(A170=\"\",\"\",IF(Lots!ET159=TRUE,\"D\",\"S\"))","v":""},0,0,0,{"$f":"IF(Lots!A159=\"\",\"\",Lots!EM159)","v":""},{"$f":"IF(Lots!A159=\"\",\"\",Lots!EN159)","v":""},{"$f":"IF(Lots!A159=\"\",\"\",Lots!EO159)","v":""},{"$f":"IF(Lots!A159=\"\",\"\",Lots!EP159)","v":""},{"$f":"IF(Lots!A159=\"\",\"\",Lots!EQ159)","v":""},{"$f":"IF(Lots!A159=\"\",\"\",Lots!ER159)","v":""}]
[{"$f":"IF(Lots!A160=\"\",\"\",Lots!A160)","v":""},{"$f":"IF(Lots!A160=\"\",\"\",Lots!F160)","v":""},{"$f":"IF(Lots!A160=\"\",\"\",Lots!J160)","v":""},{"$f":"IF(Lots!A160=\"\",\"\",Lots!G160)","v":""},{"$f":"IF(Lots!A160=\"\",\"\",Lots!H160)","v":""},{"$f":"IF(Lots!A160=\"\",\"\",Lots!EA160)","v":""},{"$f":"IF(Lots!A160=\"\",\"\",Lots!EB160)","v":""},{"$f":"IF(Lots!A160=\"\",\"\",Lots!EK160)","v":""},{"$f":"IF(Lots!A160=\"\",\"\",Lots!EF160)","v":""},{"$f":"IF(Lots!F160=\"\",\"\",Lots!EG160)","v":""},{"$f":"IF(Lots!H160=\"\",\"\",Lots!EH160)","v":""},"",{"$f":"IF(A171=\"\",\"\",IF(Lots!ET160=TRUE,\"D\",\"S\"))","v":""},0,0,0,{"$f":"IF(Lots!A160=\"\",\"\",Lots!EM160)","v":""},{"$f":"IF(Lots!A160=\"\",\"\",Lots!EN160)","v":""},{"$f":"IF(Lots!A160=\"\",\"\",Lots!EO160)","v":""},{"$f":"IF(Lots!A160=\"\",\"\",Lots!EP160)","v":""},{"$f":"IF(Lots!A160=\"\",\"\",Lots!EQ160)","v":""},{"$f":"IF(Lots!A160=\"\",\"\",Lots!ER160)","v":""}]
[{"$f":"IF(Lots!A161=\"\",\"\",Lots!A161)","v":""},{"$f":"IF(Lots!A161=\"\",\"\",Lots!F161)","v":""},{"$f":"IF(Lots!A161=\"\",\"\",Lots!J161)","v":""},{"$f":"IF(Lots!A161=\"\",\"\",Lots!G161)","v":""},{"$f":"IF(Lots!A161=\"\",\"\",Lots!H161)","v":""},{"$f":"IF(Lots!A161=\"\",\"\",Lots!EA161)","v":""},{"$f":"IF(Lots!A161=\"\",\"\",Lots!EB161)","v":""},{"$f":"IF(Lots!A161=\"\",\"\",Lots!EK161)","v":""},{"$f":"IF(Lots!A161=\"\",\"\",Lots!EF161)","v":""},{"$f":"IF(Lots!F161=\"\",\"\",Lots!EG161)","v":""},{"$f":"IF(Lots!H161=\"\",\"\",Lots!EH161)","v":""},"",{"$f":"IF(A172=\"\",\"\",IF(Lots!ET161=TRUE,\"D\",\"S\"))","v":""},0,0,0,{"$f":"IF(Lots!A161=\"\",\"\",Lots!EM161)","v":""},{"$f":"IF(Lots!A161=\"\",\"\",Lots!EN161)","v":""},{"$f":"IF(Lots!A161=\"\",\"\",Lots!EO161)","v":""},{"$f":"IF(Lots!A161=\"\",\"\",Lots!EP161)","v":""},{"$f":"IF(Lots!A161=\"\",\"\",Lots!EQ161)","v":""},{"$f":"IF(Lots!A161=\"\",\"\",Lots!ER161)","v":""}]
[{"$f":"IF(Lots!A162=\"\",\"\",Lots!A162)","v":""},{"$f":"IF(Lots!A162=\"\",\"\",Lots!F162)","v":""},{"$f":"IF(Lots!A162=\"\",\"\",Lots!J162)","v":""},{"$f":"IF(Lots!A162=\"\",\"\",Lots!G162)","v":""},{"$f":"IF(Lots!A162=\"\",\"\",Lots!H162)","v":""},{"$f":"IF(Lots!A162=\"\",\"\",Lots!EA162)","v":""},{"$f":"IF(Lots!A162=\"\",\"\",Lots!EB162)","v":""},{"$f":"IF(Lots!A162=\"\",\"\",Lots!EK162)","v":""},{"$f":"IF(Lots!A162=\"\",\"\",Lots!EF162)","v":""},{"$f":"IF(Lots!F162=\"\",\"\",Lots!EG162)","v":""},{"$f":"IF(Lots!H162=\"\",\"\",Lots!EH162)","v":""},"",{"$f":"IF(A173=\"\",\"\",IF(Lots!ET162=TRUE,\"D\",\"S\"))","v":""},0,0,0,{"$f":"IF(Lots!A162=\"\",\"\",Lots!EM162)","v":""},{"$f":"IF(Lots!A162=\"\",\"\",Lots!EN162)","v":""},{"$f":"IF(Lots!A162=\"\",\"\",Lots!EO162)","v":""},{"$f":"IF(Lots!A162=\"\",\"\",Lots!EP162)","v":""},{"$f":"IF(Lots!A162=\"\",\"\",Lots!EQ162)","v":""},{"$f":"IF(Lots!A162=\"\",\"\",Lots!ER162)","v":""}]
[{"$f":"IF(Lots!A163=\"\",\"\",Lots!A163)","v":""},{"$f":"IF(Lots!A163=\"\",\"\",Lots!F163)","v":""},{"$f":"IF(Lots!A163=\"\",\"\",Lots!J163)","v":""},{"$f":"IF(Lots!A163=\"\",\"\",Lots!G163)","v":""},{"$f":"IF(Lots!A163=\"\",\"\",Lots!H163)","v":""},{"$f":"IF(Lots!A163=\"\",\"\",Lots!EA163)","v":""},{"$f":"IF(Lots!A163=\"\",\"\",Lots!EB163)","v":""},{"$f":"IF(Lots!A163=\"\",\"\",Lots!EK163)","v":""},{"$f":"IF(Lots!A163=\"\",\"\",Lots!EF163)","v":""},{"$f":"IF(Lots!F163=\"\",\"\",Lots!EG163)","v":""},{"$f":"IF(Lots!H163=\"\",\"\",Lots!EH163)","v":""},"",{"$f":"IF(A174=\"\",\"\",IF(Lots!ET163=TRUE,\"D\",\"S\"))","v":""},0,0,0,{"$f":"IF(Lots!A163=\"\",\"\",Lots!EM163)","v":""},{"$f":"IF(Lots!A163=\"\",\"\",Lots!EN163)","v":""},{"$f":"IF(Lots!A163=\"\",\"\",Lots!EO163)","v":""},{"$f":"IF(Lots!A163=\"\",\"\",Lots!EP163)","v":""},{"$f":"IF(Lots!A163=\"\",\"\",Lots!EQ163)","v":""},{"$f":"IF(Lots!A163=\"\",\"\",Lots!ER163)","v":""}]
[{"$f":"IF(Lots!A164=\"\",\"\",Lots!A164)","v":""},{"$f":"IF(Lots!A164=\"\",\"\",Lots!F164)","v":""},{"$f":"IF(Lots!A164=\"\",\"\",Lots!J164)","v":""},{"$f":"IF(Lots!A164=\"\",\"\",Lots!G164)","v":""},{"$f":"IF(Lots!A164=\"\",\"\",Lots!H164)","v":""},{"$f":"IF(Lots!A164=\"\",\"\",Lots!EA164)","v":""},{"$f":"IF(Lots!A164=\"\",\"\",Lots!EB164)","v":""},{"$f":"IF(Lots!A164=\"\",\"\",Lots!EK164)","v":""},{"$f":"IF(Lots!A164=\"\",\"\",Lots!EF164)","v":""},{"$f":"IF(Lots!F164=\"\",\"\",Lots!EG164)","v":""},{"$f":"IF(Lots!H164=\"\",\"\",Lots!EH164)","v":""},"",{"$f":"IF(A175=\"\",\"\",IF(Lots!ET164=TRUE,\"D\",\"S\"))","v":""},0,0,0,{"$f":"IF(Lots!A164=\"\",\"\",Lots!EM164)","v":""},{"$f":"IF(Lots!A164=\"\",\"\",Lots!EN164)","v":""},{"$f":"IF(Lots!A164=\"\",\"\",Lots!EO164)","v":""},{"$f":"IF(Lots!A164=\"\",\"\",Lots!EP164)","v":""},{"$f":"IF(Lots!A164=\"\",\"\",Lots!EQ164)","v":""},{"$f":"IF(Lots!A164=\"\",\"\",Lots!ER164)","v":""}]
[{"$f":"IF(Lots!A165=\"\",\"\",Lots!A165)","v":""},{"$f":"IF(Lots!A165=\"\",\"\",Lots!F165)","v":""},{"$f":"IF(Lots!A165=\"\",\"\",Lots!J165)","v":""},{"$f":"IF(Lots!A165=\"\",\"\",Lots!G165)","v":""},{"$f":"IF(Lots!A165=\"\",\"\",Lots!H165)","v":""},{"$f":"IF(Lots!A165=\"\",\"\",Lots!EA165)","v":""},{"$f":"IF(Lots!A165=\"\",\"\",Lots!EB165)","v":""},{"$f":"IF(Lots!A165=\"\",\"\",Lots!EK165)","v":""},{"$f":"IF(Lots!A165=\"\",\"\",Lots!EF165)","v":""},{"$f":"IF(Lots!F165=\"\",\"\",Lots!EG165)","v":""},{"$f":"IF(Lots!H165=\"\",\"\",Lots!EH165)","v":""},"",{"$f":"IF(A176=\"\",\"\",IF(Lots!ET165=TRUE,\"D\",\"S\"))","v":""},0,0,0,{"$f":"IF(Lots!A165=\"\",\"\",Lots!EM165)","v":""},{"$f":"IF(Lots!A165=\"\",\"\",Lots!EN165)","v":""},{"$f":"IF(Lots!A165=\"\",\"\",Lots!EO165)","v":""},{"$f":"IF(Lots!A165=\"\",\"\",Lots!EP165)","v":""},{"$f":"IF(Lots!A165=\"\",\"\",Lots!EQ165)","v":""},{"$f":"IF(Lots!A165=\"\",\"\",Lots!ER165)","v":""}]
[{"$f":"IF(Lots!A166=\"\",\"\",Lots!A166)","v":""},{"$f":"IF(Lots!A166=\"\",\"\",Lots!F166)","v":""},{"$f":"IF(Lots!A166=\"\",\"\",Lots!J166)","v":""},{"$f":"IF(Lots!A166=\"\",\"\",Lots!G166)","v":""},{"$f":"IF(Lots!A166=\"\",\"\",Lots!H166)","v":""},{"$f":"IF(Lots!A166=\"\",\"\",Lots!EA166)","v":""},{"$f":"IF(Lots!A166=\"\",\"\",Lots!EB166)","v":""},{"$f":"IF(Lots!A166=\"\",\"\",Lots!EK166)","v":""},{"$f":"IF(Lots!A166=\"\",\"\",Lots!EF166)","v":""},{"$f":"IF(Lots!F166=\"\",\"\",Lots!EG166)","v":""},{"$f":"IF(Lots!H166=\"\",\"\",Lots!EH166)","v":""},"",{"$f":"IF(A177=\"\",\"\",IF(Lots!ET166=TRUE,\"D\",\"S\"))","v":""},0,0,0,{"$f":"IF(Lots!A166=\"\",\"\",Lots!EM166)","v":""},{"$f":"IF(Lots!A166=\"\",\"\",Lots!EN166)","v":""},{"$f":"IF(Lots!A166=\"\",\"\",Lots!EO166)","v":""},{"$f":"IF(Lots!A166=\"\",\"\",Lots!EP166)","v":""},{"$f":"IF(Lots!A166=\"\",\"\",Lots!EQ166)","v":""},{"$f":"IF(Lots!A166=\"\",\"\",Lots!ER166)","v":""}]
[{"$f":"IF(Lots!A167=\"\",\"\",Lots!A167)","v":""},{"$f":"IF(Lots!A167=\"\",\"\",Lots!F167)","v":""},{"$f":"IF(Lots!A167=\"\",\"\",Lots!J167)","v":""},{"$f":"IF(Lots!A167=\"\",\"\",Lots!G167)","v":""},{"$f":"IF(Lots!A167=\"\",\"\",Lots!H167)","v":""},{"$f":"IF(Lots!A167=\"\",\"\",Lots!EA167)","v":""},{"$f":"IF(Lots!A167=\"\",\"\",Lots!EB167)","v":""},{"$f":"IF(Lots!A167=\"\",\"\",Lots!EK167)","v":""},{"$f":"IF(Lots!A167=\"\",\"\",Lots!EF167)","v":""},{"$f":"IF(Lots!F167=\"\",\"\",Lots!EG167)","v":""},{"$f":"IF(Lots!H167=\"\",\"\",Lots!EH167)","v":""},"",{"$f":"IF(A178=\"\",\"\",IF(Lots!ET167=TRUE,\"D\",\"S\"))","v":""},0,0,0,{"$f":"IF(Lots!A167=\"\",\"\",Lots!EM167)","v":""},{"$f":"IF(Lots!A167=\"\",\"\",Lots!EN167)","v":""},{"$f":"IF(Lots!A167=\"\",\"\",Lots!EO167)","v":""},{"$f":"IF(Lots!A167=\"\",\"\",Lots!EP167)","v":""},{"$f":"IF(Lots!A167=\"\",\"\",Lots!EQ167)","v":""},{"$f":"IF(Lots!A167=\"\",\"\",Lots!ER167)","v":""}]
[{"$f":"IF(Lots!A168=\"\",\"\",Lots!A168)","v":""},{"$f":"IF(Lots!A168=\"\",\"\",Lots!F168)","v":""},{"$f":"IF(Lots!A168=\"\",\"\",Lots!J168)","v":""},{"$f":"IF(Lots!A168=\"\",\"\",Lots!G168)","v":""},{"$f":"IF(Lots!A168=\"\",\"\",Lots!H168)","v":""},{"$f":"IF(Lots!A168=\"\",\"\",Lots!EA168)","v":""},{"$f":"IF(Lots!A168=\"\",\"\",Lots!EB168)","v":""},{"$f":"IF(Lots!A168=\"\",\"\",Lots!EK168)","v":""},{"$f":"IF(Lots!A168=\"\",\"\",Lots!EF168)","v":""},{"$f":"IF(Lots!F168=\"\",\"\",Lots!EG168)","v":""},{"$f":"IF(Lots!H168=\"\",\"\",Lots!EH168)","v":""},"",{"$f":"IF(A179=\"\",\"\",IF(Lots!ET168=TRUE,\"D\",\"S\"))","v":""},0,0,0,{"$f":"IF(Lots!A168=\"\",\"\",Lots!EM168)","v":""},{"$f":"IF(Lots!A168=\"\",\"\",Lots!EN168)","v":""},{"$f":"IF(Lots!A168=\"\",\"\",Lots!EO168)","v":""},{"$f":"IF(Lots!A168=\"\",\"\",Lots!EP168)","v":""},{"$f":"IF(Lots!A168=\"\",\"\",Lots!EQ168)","v":""},{"$f":"IF(Lots!A168=\"\",\"\",Lots!ER168)","v":""}]
[{"$f":"IF(Lots!A169=\"\",\"\",Lots!A169)","v":""},{"$f":"IF(Lots!A169=\"\",\"\",Lots!F169)","v":""},{"$f":"IF(Lots!A169=\"\",\"\",Lots!J169)","v":""},{"$f":"IF(Lots!A169=\"\",\"\",Lots!G169)","v":""},{"$f":"IF(Lots!A169=\"\",\"\",Lots!H169)","v":""},{"$f":"IF(Lots!A169=\"\",\"\",Lots!EA169)","v":""},{"$f":"IF(Lots!A169=\"\",\"\",Lots!EB169)","v":""},{"$f":"IF(Lots!A169=\"\",\"\",Lots!EK169)","v":""},{"$f":"IF(Lots!A169=\"\",\"\",Lots!EF169)","v":""},{"$f":"IF(Lots!F169=\"\",\"\",Lots!EG169)","v":""},{"$f":"IF(Lots!H169=\"\",\"\",Lots!EH169)","v":""},"",{"$f":"IF(A180=\"\",\"\",IF(Lots!ET169=TRUE,\"D\",\"S\"))","v":""},0,0,0,{"$f":"IF(Lots!A169=\"\",\"\",Lots!EM169)","v":""},{"$f":"IF(Lots!A169=\"\",\"\",Lots!EN169)","v":""},{"$f":"IF(Lots!A169=\"\",\"\",Lots!EO169)","v":""},{"$f":"IF(Lots!A169=\"\",\"\",Lots!EP169)","v":""},{"$f":"IF(Lots!A169=\"\",\"\",Lots!EQ169)","v":""},{"$f":"IF(Lots!A169=\"\",\"\",Lots!ER169)","v":""}]
[{"$f":"IF(Lots!A170=\"\",\"\",Lots!A170)","v":""},{"$f":"IF(Lots!A170=\"\",\"\",Lots!F170)","v":""},{"$f":"IF(Lots!A170=\"\",\"\",Lots!J170)","v":""},{"$f":"IF(Lots!A170=\"\",\"\",Lots!G170)","v":""},{"$f":"IF(Lots!A170=\"\",\"\",Lots!H170)","v":""},{"$f":"IF(Lots!A170=\"\",\"\",Lots!EA170)","v":""},{"$f":"IF(Lots!A170=\"\",\"\",Lots!EB170)","v":""},{"$f":"IF(Lots!A170=\"\",\"\",Lots!EK170)","v":""},{"$f":"IF(Lots!A170=\"\",\"\",Lots!EF170)","v":""},{"$f":"IF(Lots!F170=\"\",\"\",Lots!EG170)","v":""},{"$f":"IF(Lots!H170=\"\",\"\",Lots!EH170)","v":""},"",{"$f":"IF(A181=\"\",\"\",IF(Lots!ET170=TRUE,\"D\",\"S\"))","v":""},0,0,0,{"$f":"IF(Lots!A170=\"\",\"\",Lots!EM170)","v":""},{"$f":"IF(Lots!A170=\"\",\"\",Lots!EN170)","v":""},{"$f":"IF(Lots!A170=\"\",\"\",Lots!EO170)","v":""},{"$f":"IF(Lots!A170=\"\",\"\",Lots!EP170)","v":""},{"$f":"IF(Lots!A170=\"\",\"\",Lots!EQ170)","v":""},{"$f":"IF(Lots!A170=\"\",\"\",Lots!ER170)","v":""}]
[{"$f":"IF(Lots!A171=\"\",\"\",Lots!A171)","v":""},{"$f":"IF(Lots!A171=\"\",\"\",Lots!F171)","v":""},{"$f":"IF(Lots!A171=\"\",\"\",Lots!J171)","v":""},{"$f":"IF(Lots!A171=\"\",\"\",Lots!G171)","v":""},{"$f":"IF(Lots!A171=\"\",\"\",Lots!H171)","v":""},{"$f":"IF(Lots!A171=\"\",\"\",Lots!EA171)","v":""},{"$f":"IF(Lots!A171=\"\",\"\",Lots!EB171)","v":""},{"$f":"IF(Lots!A171=\"\",\"\",Lots!EK171)","v":""},{"$f":"IF(Lots!A171=\"\",\"\",Lots!EF171)","v":""},{"$f":"IF(Lots!F171=\"\",\"\",Lots!EG171)","v":""},{"$f":"IF(Lots!H171=\"\",\"\",Lots!EH171)","v":""},"",{"$f":"IF(A182=\"\",\"\",IF(Lots!ET171=TRUE,\"D\",\"S\"))","v":""},0,0,0,{"$f":"IF(Lots!A171=\"\",\"\",Lots!EM171)","v":""},{"$f":"IF(Lots!A171=\"\",\"\",Lots!EN171)","v":""},{"$f":"IF(Lots!A171=\"\",\"\",Lots!EO171)","v":""},{"$f":"IF(Lots!A171=\"\",\"\",Lots!EP171)","v":""},{"$f":"IF(Lots!A171=\"\",\"\",Lots!EQ171)","v":""},{"$f":"IF(Lots!A171=\"\",\"\",Lots!ER171)","v":""}]
[{"$f":"IF(Lots!A172=\"\",\"\",Lots!A172)","v":""},{"$f":"IF(Lots!A172=\"\",\"\",Lots!F172)","v":""},{"$f":"IF(Lots!A172=\"\",\"\",Lots!J172)","v":""},{"$f":"IF(Lots!A172=\"\",\"\",Lots!G172)","v":""},{"$f":"IF(Lots!A172=\"\",\"\",Lots!H172)","v":""},{"$f":"IF(Lots!A172=\"\",\"\",Lots!EA172)","v":""},{"$f":"IF(Lots!A172=\"\",\"\",Lots!EB172)","v":""},{"$f":"IF(Lots!A172=\"\",\"\",Lots!EK172)","v":""},{"$f":"IF(Lots!A172=\"\",\"\",Lots!EF172)","v":""},{"$f":"IF(Lots!F172=\"\",\"\",Lots!EG172)","v":""},{"$f":"IF(Lots!H172=\"\",\"\",Lots!EH172)","v":""},"",{"$f":"IF(A183=\"\",\"\",IF(Lots!ET172=TRUE,\"D\",\"S\"))","v":""},0,0,0,{"$f":"IF(Lots!A172=\"\",\"\",Lots!EM172)","v":""},{"$f":"IF(Lots!A172=\"\",\"\",Lots!EN172)","v":""},{"$f":"IF(Lots!A172=\"\",\"\",Lots!EO172)","v":""},{"$f":"IF(Lots!A172=\"\",\"\",Lots!EP172)","v":""},{"$f":"IF(Lots!A172=\"\",\"\",Lots!EQ172)","v":""},{"$f":"IF(Lots!A172=\"\",\"\",Lots!ER172)","v":""}]
[{"$f":"IF(Lots!A173=\"\",\"\",Lots!A173)","v":""},{"$f":"IF(Lots!A173=\"\",\"\",Lots!F173)","v":""},{"$f":"IF(Lots!A173=\"\",\"\",Lots!J173)","v":""},{"$f":"IF(Lots!A173=\"\",\"\",Lots!G173)","v":""},{"$f":"IF(Lots!A173=\"\",\"\",Lots!H173)","v":""},{"$f":"IF(Lots!A173=\"\",\"\",Lots!EA173)","v":""},{"$f":"IF(Lots!A173=\"\",\"\",Lots!EB173)","v":""},{"$f":"IF(Lots!A173=\"\",\"\",Lots!EK173)","v":""},{"$f":"IF(Lots!A173=\"\",\"\",Lots!EF173)","v":""},{"$f":"IF(Lots!F173=\"\",\"\",Lots!EG173)","v":""},{"$f":"IF(Lots!H173=\"\",\"\",Lots!EH173)","v":""},"",{"$f":"IF(A184=\"\",\"\",IF(Lots!ET173=TRUE,\"D\",\"S\"))","v":""},0,0,0,{"$f":"IF(Lots!A173=\"\",\"\",Lots!EM173)","v":""},{"$f":"IF(Lots!A173=\"\",\"\",Lots!EN173)","v":""},{"$f":"IF(Lots!A173=\"\",\"\",Lots!EO173)","v":""},{"$f":"IF(Lots!A173=\"\",\"\",Lots!EP173)","v":""},{"$f":"IF(Lots!A173=\"\",\"\",Lots!EQ173)","v":""},{"$f":"IF(Lots!A173=\"\",\"\",Lots!ER173)","v":""}]
[{"$f":"IF(Lots!A174=\"\",\"\",Lots!A174)","v":""},{"$f":"IF(Lots!A174=\"\",\"\",Lots!F174)","v":""},{"$f":"IF(Lots!A174=\"\",\"\",Lots!J174)","v":""},{"$f":"IF(Lots!A174=\"\",\"\",Lots!G174)","v":""},{"$f":"IF(Lots!A174=\"\",\"\",Lots!H174)","v":""},{"$f":"IF(Lots!A174=\"\",\"\",Lots!EA174)","v":""},{"$f":"IF(Lots!A174=\"\",\"\",Lots!EB174)","v":""},{"$f":"IF(Lots!A174=\"\",\"\",Lots!EK174)","v":""},{"$f":"IF(Lots!A174=\"\",\"\",Lots!EF174)","v":""},{"$f":"IF(Lots!F174=\"\",\"\",Lots!EG174)","v":""},{"$f":"IF(Lots!H174=\"\",\"\",Lots!EH174)","v":""},"",{"$f":"IF(A185=\"\",\"\",IF(Lots!ET174=TRUE,\"D\",\"S\"))","v":""},0,0,0,{"$f":"IF(Lots!A174=\"\",\"\",Lots!EM174)","v":""},{"$f":"IF(Lots!A174=\"\",\"\",Lots!EN174)","v":""},{"$f":"IF(Lots!A174=\"\",\"\",Lots!EO174)","v":""},{"$f":"IF(Lots!A174=\"\",\"\",Lots!EP174)","v":""},{"$f":"IF(Lots!A174=\"\",\"\",Lots!EQ174)","v":""},{"$f":"IF(Lots!A174=\"\",\"\",Lots!ER174)","v":""}]
[{"$f":"IF(Lots!A175=\"\",\"\",Lots!A175)","v":""},{"$f":"IF(Lots!A175=\"\",\"\",Lots!F175)","v":""},{"$f":"IF(Lots!A175=\"\",\"\",Lots!J175)","v":""},{"$f":"IF(Lots!A175=\"\",\"\",Lots!G175)","v":""},{"$f":"IF(Lots!A175=\"\",\"\",Lots!H175)","v":""},{"$f":"IF(Lots!A175=\"\",\"\",Lots!EA175)","v":""},{"$f":"IF(Lots!A175=\"\",\"\",Lots!EB175)","v":""},{"$f":"IF(Lots!A175=\"\",\"\",Lots!EK175)","v":""},{"$f":"IF(Lots!A175=\"\",\"\",Lots!EF175)","v":""},{"$f":"IF(Lots!F175=\"\",\"\",Lots!EG175)","v":""},{"$f":"IF(Lots!H175=\"\",\"\",Lots!EH175)","v":""},"",{"$f":"IF(A186=\"\",\"\",IF(Lots!ET175=TRUE,\"D\",\"S\"))","v":""},0,0,0,{"$f":"IF(Lots!A175=\"\",\"\",Lots!EM175)","v":""},{"$f":"IF(Lots!A175=\"\",\"\",Lots!EN175)","v":""},{"$f":"IF(Lots!A175=\"\",\"\",Lots!EO175)","v":""},{"$f":"IF(Lots!A175=\"\",\"\",Lots!EP175)","v":""},{"$f":"IF(Lots!A175=\"\",\"\",Lots!EQ175)","v":""},{"$f":"IF(Lots!A175=\"\",\"\",Lots!ER175)","v":""}]
[{"$f":"IF(Lots!A176=\"\",\"\",Lots!A176)","v":""},{"$f":"IF(Lots!A176=\"\",\"\",Lots!F176)","v":""},{"$f":"IF(Lots!A176=\"\",\"\",Lots!J176)","v":""},{"$f":"IF(Lots!A176=\"\",\"\",Lots!G176)","v":""},{"$f":"IF(Lots!A176=\"\",\"\",Lots!H176)","v":""},{"$f":"IF(Lots!A176=\"\",\"\",Lots!EA176)","v":""},{"$f":"IF(Lots!A176=\"\",\"\",Lots!EB176)","v":""},{"$f":"IF(Lots!A176=\"\",\"\",Lots!EK176)","v":""},{"$f":"IF(Lots!A176=\"\",\"\",Lots!EF176)","v":""},{"$f":"IF(Lots!F176=\"\",\"\",Lots!EG176)","v":""},{"$f":"IF(Lots!H176=\"\",\"\",Lots!EH176)","v":""},"",{"$f":"IF(A187=\"\",\"\",IF(Lots!ET176=TRUE,\"D\",\"S\"))","v":""},0,0,0,{"$f":"IF(Lots!A176=\"\",\"\",Lots!EM176)","v":""},{"$f":"IF(Lots!A176=\"\",\"\",Lots!EN176)","v":""},{"$f":"IF(Lots!A176=\"\",\"\",Lots!EO176)","v":""},{"$f":"IF(Lots!A176=\"\",\"\",Lots!EP176)","v":""},{"$f":"IF(Lots!A176=\"\",\"\",Lots!EQ176)","v":""},{"$f":"IF(Lots!A176=\"\",\"\",Lots!ER176)","v":""}]
[{"$f":"IF(Lots!A177=\"\",\"\",Lots!A177)","v":""},{"$f":"IF(Lots!A177=\"\",\"\",Lots!F177)","v":""},{"$f":"IF(Lots!A177=\"\",\"\",Lots!J177)","v":""},{"$f":"IF(Lots!A177=\"\",\"\",Lots!G177)","v":""},{"$f":"IF(Lots!A177=\"\",\"\",Lots!H177)","v":""},{"$f":"IF(Lots!A177=\"\",\"\",Lots!EA177)","v":""},{"$f":"IF(Lots!A177=\"\",\"\",Lots!EB177)","v":""},{"$f":"IF(Lots!A177=\"\",\"\",Lots!EK177)","v":""},{"$f":"IF(Lots!A177=\"\",\"\",Lots!EF177)","v":""},{"$f":"IF(Lots!F177=\"\",\"\",Lots!EG177)","v":""},{"$f":"IF(Lots!H177=\"\",\"\",Lots!EH177)","v":""},"",{"$f":"IF(A188=\"\",\"\",IF(Lots!ET177=TRUE,\"D\",\"S\"))","v":""},0,0,0,{"$f":"IF(Lots!A177=\"\",\"\",Lots!EM177)","v":""},{"$f":"IF(Lots!A177=\"\",\"\",Lots!EN177)","v":""},{"$f":"IF(Lots!A177=\"\",\"\",Lots!EO177)","v":""},{"$f":"IF(Lots!A177=\"\",\"\",Lots!EP177)","v":""},{"$f":"IF(Lots!A177=\"\",\"\",Lots!EQ177)","v":""},{"$f":"IF(Lots!A177=\"\",\"\",Lots!ER177)","v":""}]
[{"$f":"IF(Lots!A178=\"\",\"\",Lots!A178)","v":""},{"$f":"IF(Lots!A178=\"\",\"\",Lots!F178)","v":""},{"$f":"IF(Lots!A178=\"\",\"\",Lots!J178)","v":""},{"$f":"IF(Lots!A178=\"\",\"\",Lots!G178)","v":""},{"$f":"IF(Lots!A178=\"\",\"\",Lots!H178)","v":""},{"$f":"IF(Lots!A178=\"\",\"\",Lots!EA178)","v":""},{"$f":"IF(Lots!A178=\"\",\"\",Lots!EB178)","v":""},{"$f":"IF(Lots!A178=\"\",\"\",Lots!EK178)","v":""},{"$f":"IF(Lots!A178=\"\",\"\",Lots!EF178)","v":""},{"$f":"IF(Lots!F178=\"\",\"\",Lots!EG178)","v":""},{"$f":"IF(Lots!H178=\"\",\"\",Lots!EH178)","v":""},"",{"$f":"IF(A189=\"\",\"\",IF(Lots!ET178=TRUE,\"D\",\"S\"))","v":""},0,0,0,{"$f":"IF(Lots!A178=\"\",\"\",Lots!EM178)","v":""},{"$f":"IF(Lots!A178=\"\",\"\",Lots!EN178)","v":""},{"$f":"IF(Lots!A178=\"\",\"\",Lots!EO178)","v":""},{"$f":"IF(Lots!A178=\"\",\"\",Lots!EP178)","v":""},{"$f":"IF(Lots!A178=\"\",\"\",Lots!EQ178)","v":""},{"$f":"IF(Lots!A178=\"\",\"\",Lots!ER178)","v":""}]
[{"$f":"IF(Lots!A179=\"\",\"\",Lots!A179)","v":""},{"$f":"IF(Lots!A179=\"\",\"\",Lots!F179)","v":""},{"$f":"IF(Lots!A179=\"\",\"\",Lots!J179)","v":""},{"$f":"IF(Lots!A179=\"\",\"\",Lots!G179)","v":""},{"$f":"IF(Lots!A179=\"\",\"\",Lots!H179)","v":""},{"$f":"IF(Lots!A179=\"\",\"\",Lots!EA179)","v":""},{"$f":"IF(Lots!A179=\"\",\"\",Lots!EB179)","v":""},{"$f":"IF(Lots!A179=\"\",\"\",Lots!EK179)","v":""},{"$f":"IF(Lots!A179=\"\",\"\",Lots!EF179)","v":""},{"$f":"IF(Lots!F179=\"\",\"\",Lots!EG179)","v":""},{"$f":"IF(Lots!H179=\"\",\"\",Lots!EH179)","v":""},"",{"$f":"IF(A190=\"\",\"\",IF(Lots!ET179=TRUE,\"D\",\"S\"))","v":""},0,0,0,{"$f":"IF(Lots!A179=\"\",\"\",Lots!EM179)","v":""},{"$f":"IF(Lots!A179=\"\",\"\",Lots!EN179)","v":""},{"$f":"IF(Lots!A179=\"\",\"\",Lots!EO179)","v":""},{"$f":"IF(Lots!A179=\"\",\"\",Lots!EP179)","v":""},{"$f":"IF(Lots!A179=\"\",\"\",Lots!EQ179)","v":""},{"$f":"IF(Lots!A179=\"\",\"\",Lots!ER179)","v":""}]
[{"$f":"IF(Lots!A180=\"\",\"\",Lots!A180)","v":""},{"$f":"IF(Lots!A180=\"\",\"\",Lots!F180)","v":""},{"$f":"IF(Lots!A180=\"\",\"\",Lots!J180)","v":""},{"$f":"IF(Lots!A180=\"\",\"\",Lots!G180)","v":""},{"$f":"IF(Lots!A180=\"\",\"\",Lots!H180)","v":""},{"$f":"IF(Lots!A180=\"\",\"\",Lots!EA180)","v":""},{"$f":"IF(Lots!A180=\"\",\"\",Lots!EB180)","v":""},{"$f":"IF(Lots!A180=\"\",\"\",Lots!EK180)","v":""},{"$f":"IF(Lots!A180=\"\",\"\",Lots!EF180)","v":""},{"$f":"IF(Lots!F180=\"\",\"\",Lots!EG180)","v":""},{"$f":"IF(Lots!H180=\"\",\"\",Lots!EH180)","v":""},"",{"$f":"IF(A191=\"\",\"\",IF(Lots!ET180=TRUE,\"D\",\"S\"))","v":""},0,0,0,{"$f":"IF(Lots!A180=\"\",\"\",Lots!EM180)","v":""},{"$f":"IF(Lots!A180=\"\",\"\",Lots!EN180)","v":""},{"$f":"IF(Lots!A180=\"\",\"\",Lots!EO180)","v":""},{"$f":"IF(Lots!A180=\"\",\"\",Lots!EP180)","v":""},{"$f":"IF(Lots!A180=\"\",\"\",Lots!EQ180)","v":""},{"$f":"IF(Lots!A180=\"\",\"\",Lots!ER180)","v":""}]
[{"$f":"IF(Lots!A181=\"\",\"\",Lots!A181)","v":""},{"$f":"IF(Lots!A181=\"\",\"\",Lots!F181)","v":""},{"$f":"IF(Lots!A181=\"\",\"\",Lots!J181)","v":""},{"$f":"IF(Lots!A181=\"\",\"\",Lots!G181)","v":""},{"$f":"IF(Lots!A181=\"\",\"\",Lots!H181)","v":""},{"$f":"IF(Lots!A181=\"\",\"\",Lots!EA181)","v":""},{"$f":"IF(Lots!A181=\"\",\"\",Lots!EB181)","v":""},{"$f":"IF(Lots!A181=\"\",\"\",Lots!EK181)","v":""},{"$f":"IF(Lots!A181=\"\",\"\",Lots!EF181)","v":""},{"$f":"IF(Lots!F181=\"\",\"\",Lots!EG181)","v":""},{"$f":"IF(Lots!H181=\"\",\"\",Lots!EH181)","v":""},"",{"$f":"IF(A192=\"\",\"\",IF(Lots!ET181=TRUE,\"D\",\"S\"))","v":""},0,0,0,{"$f":"IF(Lots!A181=\"\",\"\",Lots!EM181)","v":""},{"$f":"IF(Lots!A181=\"\",\"\",Lots!EN181)","v":""},{"$f":"IF(Lots!A181=\"\",\"\",Lots!EO181)","v":""},{"$f":"IF(Lots!A181=\"\",\"\",Lots!EP181)","v":""},{"$f":"IF(Lots!A181=\"\",\"\",Lots!EQ181)","v":""},{"$f":"IF(Lots!A181=\"\",\"\",Lots!ER181)","v":""}]
[{"$f":"IF(Lots!A182=\"\",\"\",Lots!A182)","v":""},{"$f":"IF(Lots!A182=\"\",\"\",Lots!F182)","v":""},{"$f":"IF(Lots!A182=\"\",\"\",Lots!J182)","v":""},{"$f":"IF(Lots!A182=\"\",\"\",Lots!G182)","v":""},{"$f":"IF(Lots!A182=\"\",\"\",Lots!H182)","v":""},{"$f":"IF(Lots!A182=\"\",\"\",Lots!EA182)","v":""},{"$f":"IF(Lots!A182=\"\",\"\",Lots!EB182)","v":""},{"$f":"IF(Lots!A182=\"\",\"\",Lots!EK182)","v":""},{"$f":"IF(Lots!A182=\"\",\"\",Lots!EF182)","v":""},{"$f":"IF(Lots!F182=\"\",\"\",Lots!EG182)","v":""},{"$f":"IF(Lots!H182=\"\",\"\",Lots!EH182)","v":""},"",{"$f":"IF(A193=\"\",\"\",IF(Lots!ET182=TRUE,\"D\",\"S\"))","v":""},0,0,0,{"$f":"IF(Lots!A182=\"\",\"\",Lots!EM182)","v":""},{"$f":"IF(Lots!A182=\"\",\"\",Lots!EN182)","v":""},{"$f":"IF(Lots!A182=\"\",\"\",Lots!EO182)","v":""},{"$f":"IF(Lots!A182=\"\",\"\",Lots!EP182)","v":""},{"$f":"IF(Lots!A182=\"\",\"\",Lots!EQ182)","v":""},{"$f":"IF(Lots!A182=\"\",\"\",Lots!ER182)","v":""}]
[{"$f":"IF(Lots!A183=\"\",\"\",Lots!A183)","v":""},{"$f":"IF(Lots!A183=\"\",\"\",Lots!F183)","v":""},{"$f":"IF(Lots!A183=\"\",\"\",Lots!J183)","v":""},{"$f":"IF(Lots!A183=\"\",\"\",Lots!G183)","v":""},{"$f":"IF(Lots!A183=\"\",\"\",Lots!H183)","v":""},{"$f":"IF(Lots!A183=\"\",\"\",Lots!EA183)","v":""},{"$f":"IF(Lots!A183=\"\",\"\",Lots!EB183)","v":""},{"$f":"IF(Lots!A183=\"\",\"\",Lots!EK183)","v":""},{"$f":"IF(Lots!A183=\"\",\"\",Lots!EF183)","v":""},{"$f":"IF(Lots!F183=\"\",\"\",Lots!EG183)","v":""},{"$f":"IF(Lots!H183=\"\",\"\",Lots!EH183)","v":""},"",{"$f":"IF(A194=\"\",\"\",IF(Lots!ET183=TRUE,\"D\",\"S\"))","v":""},0,0,0,{"$f":"IF(Lots!A183=\"\",\"\",Lots!EM183)","v":""},{"$f":"IF(Lots!A183=\"\",\"\",Lots!EN183)","v":""},{"$f":"IF(Lots!A183=\"\",\"\",Lots!EO183)","v":""},{"$f":"IF(Lots!A183=\"\",\"\",Lots!EP183)","v":""},{"$f":"IF(Lots!A183=\"\",\"\",Lots!EQ183)","v":""},{"$f":"IF(Lots!A183=\"\",\"\",Lots!ER183)","v":""}]
[{"$f":"IF(Lots!A184=\"\",\"\",Lots!A184)","v":""},{"$f":"IF(Lots!A184=\"\",\"\",Lots!F184)","v":""},{"$f":"IF(Lots!A184=\"\",\"\",Lots!J184)","v":""},{"$f":"IF(Lots!A184=\"\",\"\",Lots!G184)","v":""},{"$f":"IF(Lots!A184=\"\",\"\",Lots!H184)","v":""},{"$f":"IF(Lots!A184=\"\",\"\",Lots!EA184)","v":""},{"$f":"IF(Lots!A184=\"\",\"\",Lots!EB184)","v":""},{"$f":"IF(Lots!A184=\"\",\"\",Lots!EK184)","v":""},{"$f":"IF(Lots!A184=\"\",\"\",Lots!EF184)","v":""},{"$f":"IF(Lots!F184=\"\",\"\",Lots!EG184)","v":""},{"$f":"IF(Lots!H184=\"\",\"\",Lots!EH184)","v":""},"",{"$f":"IF(A195=\"\",\"\",IF(Lots!ET184=TRUE,\"D\",\"S\"))","v":""},0,0,0,{"$f":"IF(Lots!A184=\"\",\"\",Lots!EM184)","v":""},{"$f":"IF(Lots!A184=\"\",\"\",Lots!EN184)","v":""},{"$f":"IF(Lots!A184=\"\",\"\",Lots!EO184)","v":""},{"$f":"IF(Lots!A184=\"\",\"\",Lots!EP184)","v":""},{"$f":"IF(Lots!A184=\"\",\"\",Lots!EQ184)","v":""},{"$f":"IF(Lots!A184=\"\",\"\",Lots!ER184)","v":""}]
[{"$f":"IF(Lots!A185=\"\",\"\",Lots!A185)","v":""},{"$f":"IF(Lots!A185=\"\",\"\",Lots!F185)","v":""},{"$f":"IF(Lots!A185=\"\",\"\",Lots!J185)","v":""},{"$f":"IF(Lots!A185=\"\",\"\",Lots!G185)","v":""},{"$f":"IF(Lots!A185=\"\",\"\",Lots!H185)","v":""},{"$f":"IF(Lots!A185=\"\",\"\",Lots!EA185)","v":""},{"$f":"IF(Lots!A185=\"\",\"\",Lots!EB185)","v":""},{"$f":"IF(Lots!A185=\"\",\"\",Lots!EK185)","v":""},{"$f":"IF(Lots!A185=\"\",\"\",Lots!EF185)","v":""},{"$f":"IF(Lots!F185=\"\",\"\",Lots!EG185)","v":""},{"$f":"IF(Lots!H185=\"\",\"\",Lots!EH185)","v":""},"",{"$f":"IF(A196=\"\",\"\",IF(Lots!ET185=TRUE,\"D\",\"S\"))","v":""},0,0,0,{"$f":"IF(Lots!A185=\"\",\"\",Lots!EM185)","v":""},{"$f":"IF(Lots!A185=\"\",\"\",Lots!EN185)","v":""},{"$f":"IF(Lots!A185=\"\",\"\",Lots!EO185)","v":""},{"$f":"IF(Lots!A185=\"\",\"\",Lots!EP185)","v":""},{"$f":"IF(Lots!A185=\"\",\"\",Lots!EQ185)","v":""},{"$f":"IF(Lots!A185=\"\",\"\",Lots!ER185)","v":""}]
[{"$f":"IF(Lots!A186=\"\",\"\",Lots!A186)","v":""},{"$f":"IF(Lots!A186=\"\",\"\",Lots!F186)","v":""},{"$f":"IF(Lots!A186=\"\",\"\",Lots!J186)","v":""},{"$f":"IF(Lots!A186=\"\",\"\",Lots!G186)","v":""},{"$f":"IF(Lots!A186=\"\",\"\",Lots!H186)","v":""},{"$f":"IF(Lots!A186=\"\",\"\",Lots!EA186)","v":""},{"$f":"IF(Lots!A186=\"\",\"\",Lots!EB186)","v":""},{"$f":"IF(Lots!A186=\"\",\"\",Lots!EK186)","v":""},{"$f":"IF(Lots!A186=\"\",\"\",Lots!EF186)","v":""},{"$f":"IF(Lots!F186=\"\",\"\",Lots!EG186)","v":""},{"$f":"IF(Lots!H186=\"\",\"\",Lots!EH186)","v":""},"",{"$f":"IF(A197=\"\",\"\",IF(Lots!ET186=TRUE,\"D\",\"S\"))","v":""},0,0,0,{"$f":"IF(Lots!A186=\"\",\"\",Lots!EM186)","v":""},{"$f":"IF(Lots!A186=\"\",\"\",Lots!EN186)","v":""},{"$f":"IF(Lots!A186=\"\",\"\",Lots!EO186)","v":""},{"$f":"IF(Lots!A186=\"\",\"\",Lots!EP186)","v":""},{"$f":"IF(Lots!A186=\"\",\"\",Lots!EQ186)","v":""},{"$f":"IF(Lots!A186=\"\",\"\",Lots!ER186)","v":""}]
[{"$f":"IF(Lots!A187=\"\",\"\",Lots!A187)","v":""},{"$f":"IF(Lots!A187=\"\",\"\",Lots!F187)","v":""},{"$f":"IF(Lots!A187=\"\",\"\",Lots!J187)","v":""},{"$f":"IF(Lots!A187=\"\",\"\",Lots!G187)","v":""},{"$f":"IF(Lots!A187=\"\",\"\",Lots!H187)","v":""},{"$f":"IF(Lots!A187=\"\",\"\",Lots!EA187)","v":""},{"$f":"IF(Lots!A187=\"\",\"\",Lots!EB187)","v":""},{"$f":"IF(Lots!A187=\"\",\"\",Lots!EK187)","v":""},{"$f":"IF(Lots!A187=\"\",\"\",Lots!EF187)","v":""},{"$f":"IF(Lots!F187=\"\",\"\",Lots!EG187)","v":""},{"$f":"IF(Lots!H187=\"\",\"\",Lots!EH187)","v":""},"",{"$f":"IF(A198=\"\",\"\",IF(Lots!ET187=TRUE,\"D\",\"S\"))","v":""},0,0,0,{"$f":"IF(Lots!A187=\"\",\"\",Lots!EM187)","v":""},{"$f":"IF(Lots!A187=\"\",\"\",Lots!EN187)","v":""},{"$f":"IF(Lots!A187=\"\",\"\",Lots!EO187)","v":""},{"$f":"IF(Lots!A187=\"\",\"\",Lots!EP187)","v":""},{"$f":"IF(Lots!A187=\"\",\"\",Lots!EQ187)","v":""},{"$f":"IF(Lots!A187=\"\",\"\",Lots!ER187)","v":""}]
[{"$f":"IF(Lots!A188=\"\",\"\",Lots!A188)","v":""},{"$f":"IF(Lots!A188=\"\",\"\",Lots!F188)","v":""},{"$f":"IF(Lots!A188=\"\",\"\",Lots!J188)","v":""},{"$f":"IF(Lots!A188=\"\",\"\",Lots!G188)","v":""},{"$f":"IF(Lots!A188=\"\",\"\",Lots!H188)","v":""},{"$f":"IF(Lots!A188=\"\",\"\",Lots!EA188)","v":""},{"$f":"IF(Lots!A188=\"\",\"\",Lots!EB188)","v":""},{"$f":"IF(Lots!A188=\"\",\"\",Lots!EK188)","v":""},{"$f":"IF(Lots!A188=\"\",\"\",Lots!EF188)","v":""},{"$f":"IF(Lots!F188=\"\",\"\",Lots!EG188)","v":""},{"$f":"IF(Lots!H188=\"\",\"\",Lots!EH188)","v":""},"",{"$f":"IF(A199=\"\",\"\",IF(Lots!ET188=TRUE,\"D\",\"S\"))","v":""},0,0,0,{"$f":"IF(Lots!A188=\"\",\"\",Lots!EM188)","v":""},{"$f":"IF(Lots!A188=\"\",\"\",Lots!EN188)","v":""},{"$f":"IF(Lots!A188=\"\",\"\",Lots!EO188)","v":""},{"$f":"IF(Lots!A188=\"\",\"\",Lots!EP188)","v":""},{"$f":"IF(Lots!A188=\"\",\"\",Lots!EQ188)","v":""},{"$f":"IF(Lots!A188=\"\",\"\",Lots!ER188)","v":""}]
[{"$f":"IF(Lots!A189=\"\",\"\",Lots!A189)","v":""},{"$f":"IF(Lots!A189=\"\",\"\",Lots!F189)","v":""},{"$f":"IF(Lots!A189=\"\",\"\",Lots!J189)","v":""},{"$f":"IF(Lots!A189=\"\",\"\",Lots!G189)","v":""},{"$f":"IF(Lots!A189=\"\",\"\",Lots!H189)","v":""},{"$f":"IF(Lots!A189=\"\",\"\",Lots!EA189)","v":""},{"$f":"IF(Lots!A189=\"\",\"\",Lots!EB189)","v":""},{"$f":"IF(Lots!A189=\"\",\"\",Lots!EK189)","v":""},{"$f":"IF(Lots!A189=\"\",\"\",Lots!EF189)","v":""},{"$f":"IF(Lots!F189=\"\",\"\",Lots!EG189)","v":""},{"$f":"IF(Lots!H189=\"\",\"\",Lots!EH189)","v":""},"",{"$f":"IF(A200=\"\",\"\",IF(Lots!ET189=TRUE,\"D\",\"S\"))","v":""},0,0,0,{"$f":"IF(Lots!A189=\"\",\"\",Lots!EM189)","v":""},{"$f":"IF(Lots!A189=\"\",\"\",Lots!EN189)","v":""},{"$f":"IF(Lots!A189=\"\",\"\",Lots!EO189)","v":""},{"$f":"IF(Lots!A189=\"\",\"\",Lots!EP189)","v":""},{"$f":"IF(Lots!A189=\"\",\"\",Lots!EQ189)","v":""},{"$f":"IF(Lots!A189=\"\",\"\",Lots!ER189)","v":""}]
[{"$f":"IF(Lots!A190=\"\",\"\",Lots!A190)","v":""},{"$f":"IF(Lots!A190=\"\",\"\",Lots!F190)","v":""},{"$f":"IF(Lots!A190=\"\",\"\",Lots!J190)","v":""},{"$f":"IF(Lots!A190=\"\",\"\",Lots!G190)","v":""},{"$f":"IF(Lots!A190=\"\",\"\",Lots!H190)","v":""},{"$f":"IF(Lots!A190=\"\",\"\",Lots!EA190)","v":""},{"$f":"IF(Lots!A190=\"\",\"\",Lots!EB190)","v":""},{"$f":"IF(Lots!A190=\"\",\"\",Lots!EK190)","v":""},{"$f":"IF(Lots!A190=\"\",\"\",Lots!EF190)","v":""},{"$f":"IF(Lots!F190=\"\",\"\",Lots!EG190)","v":""},{"$f":"IF(Lots!H190=\"\",\"\",Lots!EH190)","v":""},"",{"$f":"IF(A201=\"\",\"\",IF(Lots!ET190=TRUE,\"D\",\"S\"))","v":""},0,0,0,{"$f":"IF(Lots!A190=\"\",\"\",Lots!EM190)","v":""},{"$f":"IF(Lots!A190=\"\",\"\",Lots!EN190)","v":""},{"$f":"IF(Lots!A190=\"\",\"\",Lots!EO190)","v":""},{"$f":"IF(Lots!A190=\"\",\"\",Lots!EP190)","v":""},{"$f":"IF(Lots!A190=\"\",\"\",Lots!EQ190)","v":""},{"$f":"IF(Lots!A190=\"\",\"\",Lots!ER190)","v":""}]
[{"$f":"IF(Lots!A191=\"\",\"\",Lots!A191)","v":""},{"$f":"IF(Lots!A191=\"\",\"\",Lots!F191)","v":""},{"$f":"IF(Lots!A191=\"\",\"\",Lots!J191)","v":""},{"$f":"IF(Lots!A191=\"\",\"\",Lots!G191)","v":""},{"$f":"IF(Lots!A191=\"\",\"\",Lots!H191)","v":""},{"$f":"IF(Lots!A191=\"\",\"\",Lots!EA191)","v":""},{"$f":"IF(Lots!A191=\"\",\"\",Lots!EB191)","v":""},{"$f":"IF(Lots!A191=\"\",\"\",Lots!EK191)","v":""},{"$f":"IF(Lots!A191=\"\",\"\",Lots!EF191)","v":""},{"$f":"IF(Lots!F191=\"\",\"\",Lots!EG191)","v":""},{"$f":"IF(Lots!H191=\"\",\"\",Lots!EH191)","v":""},"",{"$f":"IF(A202=\"\",\"\",IF(Lots!ET191=TRUE,\"D\",\"S\"))","v":""},0,0,0,{"$f":"IF(Lots!A191=\"\",\"\",Lots!EM191)","v":""},{"$f":"IF(Lots!A191=\"\",\"\",Lots!EN191)","v":""},{"$f":"IF(Lots!A191=\"\",\"\",Lots!EO191)","v":""},{"$f":"IF(Lots!A191=\"\",\"\",Lots!EP191)","v":""},{"$f":"IF(Lots!A191=\"\",\"\",Lots!EQ191)","v":""},{"$f":"IF(Lots!A191=\"\",\"\",Lots!ER191)","v":""}]
[{"$f":"IF(Lots!A192=\"\",\"\",Lots!A192)","v":""},{"$f":"IF(Lots!A192=\"\",\"\",Lots!F192)","v":""},{"$f":"IF(Lots!A192=\"\",\"\",Lots!J192)","v":""},{"$f":"IF(Lots!A192=\"\",\"\",Lots!G192)","v":""},{"$f":"IF(Lots!A192=\"\",\"\",Lots!H192)","v":""},{"$f":"IF(Lots!A192=\"\",\"\",Lots!EA192)","v":""},{"$f":"IF(Lots!A192=\"\",\"\",Lots!EB192)","v":""},{"$f":"IF(Lots!A192=\"\",\"\",Lots!EK192)","v":""},{"$f":"IF(Lots!A192=\"\",\"\",Lots!EF192)","v":""},{"$f":"IF(Lots!F192=\"\",\"\",Lots!EG192)","v":""},{"$f":"IF(Lots!H192=\"\",\"\",Lots!EH192)","v":""},"",{"$f":"IF(A203=\"\",\"\",IF(Lots!ET192=TRUE,\"D\",\"S\"))","v":""},0,0,0,{"$f":"IF(Lots!A192=\"\",\"\",Lots!EM192)","v":""},{"$f":"IF(Lots!A192=\"\",\"\",Lots!EN192)","v":""},{"$f":"IF(Lots!A192=\"\",\"\",Lots!EO192)","v":""},{"$f":"IF(Lots!A192=\"\",\"\",Lots!EP192)","v":""},{"$f":"IF(Lots!A192=\"\",\"\",Lots!EQ192)","v":""},{"$f":"IF(Lots!A192=\"\",\"\",Lots!ER192)","v":""}]
[{"$f":"IF(Lots!A193=\"\",\"\",Lots!A193)","v":""},{"$f":"IF(Lots!A193=\"\",\"\",Lots!F193)","v":""},{"$f":"IF(Lots!A193=\"\",\"\",Lots!J193)","v":""},{"$f":"IF(Lots!A193=\"\",\"\",Lots!G193)","v":""},{"$f":"IF(Lots!A193=\"\",\"\",Lots!H193)","v":""},{"$f":"IF(Lots!A193=\"\",\"\",Lots!EA193)","v":""},{"$f":"IF(Lots!A193=\"\",\"\",Lots!EB193)","v":""},{"$f":"IF(Lots!A193=\"\",\"\",Lots!EK193)","v":""},{"$f":"IF(Lots!A193=\"\",\"\",Lots!EF193)","v":""},{"$f":"IF(Lots!F193=\"\",\"\",Lots!EG193)","v":""},{"$f":"IF(Lots!H193=\"\",\"\",Lots!EH193)","v":""},"",{"$f":"IF(A204=\"\",\"\",IF(Lots!ET193=TRUE,\"D\",\"S\"))","v":""},0,0,0,{"$f":"IF(Lots!A193=\"\",\"\",Lots!EM193)","v":""},{"$f":"IF(Lots!A193=\"\",\"\",Lots!EN193)","v":""},{"$f":"IF(Lots!A193=\"\",\"\",Lots!EO193)","v":""},{"$f":"IF(Lots!A193=\"\",\"\",Lots!EP193)","v":""},{"$f":"IF(Lots!A193=\"\",\"\",Lots!EQ193)","v":""},{"$f":"IF(Lots!A193=\"\",\"\",Lots!ER193)","v":""}]
[{"$f":"IF(Lots!A194=\"\",\"\",Lots!A194)","v":""},{"$f":"IF(Lots!A194=\"\",\"\",Lots!F194)","v":""},{"$f":"IF(Lots!A194=\"\",\"\",Lots!J194)","v":""},{"$f":"IF(Lots!A194=\"\",\"\",Lots!G194)","v":""},{"$f":"IF(Lots!A194=\"\",\"\",Lots!H194)","v":""},{"$f":"IF(Lots!A194=\"\",\"\",Lots!EA194)","v":""},{"$f":"IF(Lots!A194=\"\",\"\",Lots!EB194)","v":""},{"$f":"IF(Lots!A194=\"\",\"\",Lots!EK194)","v":""},{"$f":"IF(Lots!A194=\"\",\"\",Lots!EF194)","v":""},{"$f":"IF(Lots!F194=\"\",\"\",Lots!EG194)","v":""},{"$f":"IF(Lots!H194=\"\",\"\",Lots!EH194)","v":""},"",{"$f":"IF(A205=\"\",\"\",IF(Lots!ET194=TRUE,\"D\",\"S\"))","v":""},0,0,0,{"$f":"IF(Lots!A194=\"\",\"\",Lots!EM194)","v":""},{"$f":"IF(Lots!A194=\"\",\"\",Lots!EN194)","v":""},{"$f":"IF(Lots!A194=\"\",\"\",Lots!EO194)","v":""},{"$f":"IF(Lots!A194=\"\",\"\",Lots!EP194)","v":""},{"$f":"IF(Lots!A194=\"\",\"\",Lots!EQ194)","v":""},{"$f":"IF(Lots!A194=\"\",\"\",Lots!ER194)","v":""}]
[{"$f":"IF(Lots!A195=\"\",\"\",Lots!A195)","v":""},{"$f":"IF(Lots!A195=\"\",\"\",Lots!F195)","v":""},{"$f":"IF(Lots!A195=\"\",\"\",Lots!J195)","v":""},{"$f":"IF(Lots!A195=\"\",\"\",Lots!G195)","v":""},{"$f":"IF(Lots!A195=\"\",\"\",Lots!H195)","v":""},{"$f":"IF(Lots!A195=\"\",\"\",Lots!EA195)","v":""},{"$f":"IF(Lots!A195=\"\",\"\",Lots!EB195)","v":""},{"$f":"IF(Lots!A195=\"\",\"\",Lots!EK195)","v":""},{"$f":"IF(Lots!A195=\"\",\"\",Lots!EF195)","v":""},{"$f":"IF(Lots!F195=\"\",\"\",Lots!EG195)","v":""},{"$f":"IF(Lots!H195=\"\",\"\",Lots!EH195)","v":""},"",{"$f":"IF(A206=\"\",\"\",IF(Lots!ET195=TRUE,\"D\",\"S\"))","v":""},0,0,0,{"$f":"IF(Lots!A195=\"\",\"\",Lots!EM195)","v":""},{"$f":"IF(Lots!A195=\"\",\"\",Lots!EN195)","v":""},{"$f":"IF(Lots!A195=\"\",\"\",Lots!EO195)","v":""},{"$f":"IF(Lots!A195=\"\",\"\",Lots!EP195)","v":""},{"$f":"IF(Lots!A195=\"\",\"\",Lots!EQ195)","v":""},{"$f":"IF(Lots!A195=\"\",\"\",Lots!ER195)","v":""}]
[{"$f":"IF(Lots!A196=\"\",\"\",Lots!A196)","v":""},{"$f":"IF(Lots!A196=\"\",\"\",Lots!F196)","v":""},{"$f":"IF(Lots!A196=\"\",\"\",Lots!J196)","v":""},{"$f":"IF(Lots!A196=\"\",\"\",Lots!G196)","v":""},{"$f":"IF(Lots!A196=\"\",\"\",Lots!H196)","v":""},{"$f":"IF(Lots!A196=\"\",\"\",Lots!EA196)","v":""},{"$f":"IF(Lots!A196=\"\",\"\",Lots!EB196)","v":""},{"$f":"IF(Lots!A196=\"\",\"\",Lots!EK196)","v":""},{"$f":"IF(Lots!A196=\"\",\"\",Lots!EF196)","v":""},{"$f":"IF(Lots!F196=\"\",\"\",Lots!EG196)","v":""},{"$f":"IF(Lots!H196=\"\",\"\",Lots!EH196)","v":""},"",{"$f":"IF(A207=\"\",\"\",IF(Lots!ET196=TRUE,\"D\",\"S\"))","v":""},0,0,0,{"$f":"IF(Lots!A196=\"\",\"\",Lots!EM196)","v":""},{"$f":"IF(Lots!A196=\"\",\"\",Lots!EN196)","v":""},{"$f":"IF(Lots!A196=\"\",\"\",Lots!EO196)","v":""},{"$f":"IF(Lots!A196=\"\",\"\",Lots!EP196)","v":""},{"$f":"IF(Lots!A196=\"\",\"\",Lots!EQ196)","v":""},{"$f":"IF(Lots!A196=\"\",\"\",Lots!ER196)","v":""}]
[{"$f":"IF(Lots!A197=\"\",\"\",Lots!A197)","v":""},{"$f":"IF(Lots!A197=\"\",\"\",Lots!F197)","v":""},{"$f":"IF(Lots!A197=\"\",\"\",Lots!J197)","v":""},{"$f":"IF(Lots!A197=\"\",\"\",Lots!G197)","v":""},{"$f":"IF(Lots!A197=\"\",\"\",Lots!H197)","v":""},{"$f":"IF(Lots!A197=\"\",\"\",Lots!EA197)","v":""},{"$f":"IF(Lots!A197=\"\",\"\",Lots!EB197)","v":""},{"$f":"IF(Lots!A197=\"\",\"\",Lots!EK197)","v":""},{"$f":"IF(Lots!A197=\"\",\"\",Lots!EF197)","v":""},{"$f":"IF(Lots!F197=\"\",\"\",Lots!EG197)","v":""},{"$f":"IF(Lots!H197=\"\",\"\",Lots!EH197)","v":""},"",{"$f":"IF(A208=\"\",\"\",IF(Lots!ET197=TRUE,\"D\",\"S\"))","v":""},0,0,0,{"$f":"IF(Lots!A197=\"\",\"\",Lots!EM197)","v":""},{"$f":"IF(Lots!A197=\"\",\"\",Lots!EN197)","v":""},{"$f":"IF(Lots!A197=\"\",\"\",Lots!EO197)","v":""},{"$f":"IF(Lots!A197=\"\",\"\",Lots!EP197)","v":""},{"$f":"IF(Lots!A197=\"\",\"\",Lots!EQ197)","v":""},{"$f":"IF(Lots!A197=\"\",\"\",Lots!ER197)","v":""}]
[{"$f":"IF(Lots!A198=\"\",\"\",Lots!A198)","v":""},{"$f":"IF(Lots!A198=\"\",\"\",Lots!F198)","v":""},{"$f":"IF(Lots!A198=\"\",\"\",Lots!J198)","v":""},{"$f":"IF(Lots!A198=\"\",\"\",Lots!G198)","v":""},{"$f":"IF(Lots!A198=\"\",\"\",Lots!H198)","v":""},{"$f":"IF(Lots!A198=\"\",\"\",Lots!EA198)","v":""},{"$f":"IF(Lots!A198=\"\",\"\",Lots!EB198)","v":""},{"$f":"IF(Lots!A198=\"\",\"\",Lots!EK198)","v":""},{"$f":"IF(Lots!A198=\"\",\"\",Lots!EF198)","v":""},{"$f":"IF(Lots!F198=\"\",\"\",Lots!EG198)","v":""},{"$f":"IF(Lots!H198=\"\",\"\",Lots!EH198)","v":""},"",{"$f":"IF(A209=\"\",\"\",IF(Lots!ET198=TRUE,\"D\",\"S\"))","v":""},0,0,0,{"$f":"IF(Lots!A198=\"\",\"\",Lots!EM198)","v":""},{"$f":"IF(Lots!A198=\"\",\"\",Lots!EN198)","v":""},{"$f":"IF(Lots!A198=\"\",\"\",Lots!EO198)","v":""},{"$f":"IF(Lots!A198=\"\",\"\",Lots!EP198)","v":""},{"$f":"IF(Lots!A198=\"\",\"\",Lots!EQ198)","v":""},{"$f":"IF(Lots!A198=\"\",\"\",Lots!ER198)","v":""}]
[{"$f":"IF(Lots!A199=\"\",\"\",Lots!A199)","v":""},{"$f":"IF(Lots!A199=\"\",\"\",Lots!F199)","v":""},{"$f":"IF(Lots!A199=\"\",\"\",Lots!J199)","v":""},{"$f":"IF(Lots!A199=\"\",\"\",Lots!G199)","v":""},{"$f":"IF(Lots!A199=\"\",\"\",Lots!H199)","v":""},{"$f":"IF(Lots!A199=\"\",\"\",Lots!EA199)","v":""},{"$f":"IF(Lots!A199=\"\",\"\",Lots!EB199)","v":""},{"$f":"IF(Lots!A199=\"\",\"\",Lots!EK199)","v":""},{"$f":"IF(Lots!A199=\"\",\"\",Lots!EF199)","v":""},{"$f":"IF(Lots!F199=\"\",\"\",Lots!EG199)","v":""},{"$f":"IF(Lots!H199=\"\",\"\",Lots!EH199)","v":""},"",{"$f":"IF(A210=\"\",\"\",IF(Lots!ET199=TRUE,\"D\",\"S\"))","v":""},0,0,0,{"$f":"IF(Lots!A199=\"\",\"\",Lots!EM199)","v":""},{"$f":"IF(Lots!A199=\"\",\"\",Lots!EN199)","v":""},{"$f":"IF(Lots!A199=\"\",\"\",Lots!EO199)","v":""},{"$f":"IF(Lots!A199=\"\",\"\",Lots!EP199)","v":""},{"$f":"IF(Lots!A199=\"\",\"\",Lots!EQ199)","v":""},{"$f":"IF(Lots!A199=\"\",\"\",Lots!ER199)","v":""}]
[{"$f":"IF(Lots!A200=\"\",\"\",Lots!A200)","v":""},{"$f":"IF(Lots!A200=\"\",\"\",Lots!F200)","v":""},{"$f":"IF(Lots!A200=\"\",\"\",Lots!J200)","v":""},{"$f":"IF(Lots!A200=\"\",\"\",Lots!G200)","v":""},{"$f":"IF(Lots!A200=\"\",\"\",Lots!H200)","v":""},{"$f":"IF(Lots!A200=\"\",\"\",Lots!EA200)","v":""},{"$f":"IF(Lots!A200=\"\",\"\",Lots!EB200)","v":""},{"$f":"IF(Lots!A200=\"\",\"\",Lots!EK200)","v":""},{"$f":"IF(Lots!A200=\"\",\"\",Lots!EF200)","v":""},{"$f":"IF(Lots!F200=\"\",\"\",Lots!EG200)","v":""},{"$f":"IF(Lots!H200=\"\",\"\",Lots!EH200)","v":""},"",{"$f":"IF(A211=\"\",\"\",IF(Lots!ET200=TRUE,\"D\",\"S\"))","v":""},0,0,0,{"$f":"IF(Lots!A200=\"\",\"\",Lots!EM200)","v":""},{"$f":"IF(Lots!A200=\"\",\"\",Lots!EN200)","v":""},{"$f":"IF(Lots!A200=\"\",\"\",Lots!EO200)","v":""},{"$f":"IF(Lots!A200=\"\",\"\",Lots!EP200)","v":""},{"$f":"IF(Lots!A200=\"\",\"\",Lots!EQ200)","v":""},{"$f":"IF(Lots!A200=\"\",\"\",Lots!ER200)","v":""}]
[{"$f":"IF(Lots!A201=\"\",\"\",Lots!A201)","v":""},{"$f":"IF(Lots!A201=\"\",\"\",Lots!F201)","v":""},{"$f":"IF(Lots!A201=\"\",\"\",Lots!J201)","v":""},{"$f":"IF(Lots!A201=\"\",\"\",Lots!G201)","v":""},{"$f":"IF(Lots!A201=\"\",\"\",Lots!H201)","v":""},{"$f":"IF(Lots!A201=\"\",\"\",Lots!EA201)","v":""},{"$f":"IF(Lots!A201=\"\",\"\",Lots!EB201)","v":""},{"$f":"IF(Lots!A201=\"\",\"\",Lots!EK201)","v":""},{"$f":"IF(Lots!A201=\"\",\"\",Lots!EF201)","v":""},{"$f":"IF(Lots!F201=\"\",\"\",Lots!EG201)","v":""},{"$f":"IF(Lots!H201=\"\",\"\",Lots!EH201)","v":""},"",{"$f":"IF(A212=\"\",\"\",IF(Lots!ET201=TRUE,\"D\",\"S\"))","v":""},0,0,0,{"$f":"IF(Lots!A201=\"\",\"\",Lots!EM201)","v":""},{"$f":"IF(Lots!A201=\"\",\"\",Lots!EN201)","v":""},{"$f":"IF(Lots!A201=\"\",\"\",Lots!EO201)","v":""},{"$f":"IF(Lots!A201=\"\",\"\",Lots!EP201)","v":""},{"$f":"IF(Lots!A201=\"\",\"\",Lots!EQ201)","v":""},{"$f":"IF(Lots!A201=\"\",\"\",Lots!ER201)","v":""}]
[{"$f":"IF(Lots!A202=\"\",\"\",Lots!A202)","v":""},{"$f":"IF(Lots!A202=\"\",\"\",Lots!F202)","v":""},{"$f":"IF(Lots!A202=\"\",\"\",Lots!J202)","v":""},{"$f":"IF(Lots!A202=\"\",\"\",Lots!G202)","v":""},{"$f":"IF(Lots!A202=\"\",\"\",Lots!H202)","v":""},{"$f":"IF(Lots!A202=\"\",\"\",Lots!EA202)","v":""},{"$f":"IF(Lots!A202=\"\",\"\",Lots!EB202)","v":""},{"$f":"IF(Lots!A202=\"\",\"\",Lots!EK202)","v":""},{"$f":"IF(Lots!A202=\"\",\"\",Lots!EF202)","v":""},{"$f":"IF(Lots!F202=\"\",\"\",Lots!EG202)","v":""},{"$f":"IF(Lots!H202=\"\",\"\",Lots!EH202)","v":""},"",{"$f":"IF(A213=\"\",\"\",IF(Lots!ET202=TRUE,\"D\",\"S\"))","v":""},0,0,0,{"$f":"IF(Lots!A202=\"\",\"\",Lots!EM202)","v":""},{"$f":"IF(Lots!A202=\"\",\"\",Lots!EN202)","v":""},{"$f":"IF(Lots!A202=\"\",\"\",Lots!EO202)","v":""},{"$f":"IF(Lots!A202=\"\",\"\",Lots!EP202)","v":""},{"$f":"IF(Lots!A202=\"\",\"\",Lots!EQ202)","v":""},{"$f":"IF(Lots!A202=\"\",\"\",Lots!ER202)","v":""}]
[{"$f":"IF(Lots!A203=\"\",\"\",Lots!A203)","v":""},{"$f":"IF(Lots!A203=\"\",\"\",Lots!F203)","v":""},{"$f":"IF(Lots!A203=\"\",\"\",Lots!J203)","v":""},{"$f":"IF(Lots!A203=\"\",\"\",Lots!G203)","v":""},{"$f":"IF(Lots!A203=\"\",\"\",Lots!H203)","v":""},{"$f":"IF(Lots!A203=\"\",\"\",Lots!EA203)","v":""},{"$f":"IF(Lots!A203=\"\",\"\",Lots!EB203)","v":""},{"$f":"IF(Lots!A203=\"\",\"\",Lots!EK203)","v":""},{"$f":"IF(Lots!A203=\"\",\"\",Lots!EF203)","v":""},{"$f":"IF(Lots!F203=\"\",\"\",Lots!EG203)","v":""},{"$f":"IF(Lots!H203=\"\",\"\",Lots!EH203)","v":""},"",{"$f":"IF(A214=\"\",\"\",IF(Lots!ET203=TRUE,\"D\",\"S\"))","v":""},0,0,0,{"$f":"IF(Lots!A203=\"\",\"\",Lots!EM203)","v":""},{"$f":"IF(Lots!A203=\"\",\"\",Lots!EN203)","v":""},{"$f":"IF(Lots!A203=\"\",\"\",Lots!EO203)","v":""},{"$f":"IF(Lots!A203=\"\",\"\",Lots!EP203)","v":""},{"$f":"IF(Lots!A203=\"\",\"\",Lots!EQ203)","v":""},{"$f":"IF(Lots!A203=\"\",\"\",Lots!ER203)","v":""}]
[{"$f":"IF(Lots!A204=\"\",\"\",Lots!A204)","v":""},{"$f":"IF(Lots!A204=\"\",\"\",Lots!F204)","v":""},{"$f":"IF(Lots!A204=\"\",\"\",Lots!J204)","v":""},{"$f":"IF(Lots!A204=\"\",\"\",Lots!G204)","v":""},{"$f":"IF(Lots!A204=\"\",\"\",Lots!H204)","v":""},{"$f":"IF(Lots!A204=\"\",\"\",Lots!EA204)","v":""},{"$f":"IF(Lots!A204=\"\",\"\",Lots!EB204)","v":""},{"$f":"IF(Lots!A204=\"\",\"\",Lots!EK204)","v":""},{"$f":"IF(Lots!A204=\"\",\"\",Lots!EF204)","v":""},{"$f":"IF(Lots!F204=\"\",\"\",Lots!EG204)","v":""},{"$f":"IF(Lots!H204=\"\",\"\",Lots!EH204)","v":""},"",{"$f":"IF(A215=\"\",\"\",IF(Lots!ET204=TRUE,\"D\",\"S\"))","v":""},0,0,0,{"$f":"IF(Lots!A204=\"\",\"\",Lots!EM204)","v":""},{"$f":"IF(Lots!A204=\"\",\"\",Lots!EN204)","v":""},{"$f":"IF(Lots!A204=\"\",\"\",Lots!EO204)","v":""},{"$f":"IF(Lots!A204=\"\",\"\",Lots!EP204)","v":""},{"$f":"IF(Lots!A204=\"\",\"\",Lots!EQ204)","v":""},{"$f":"IF(Lots!A204=\"\",\"\",Lots!ER204)","v":""}]
[{"$f":"IF(Lots!A205=\"\",\"\",Lots!A205)","v":""},{"$f":"IF(Lots!A205=\"\",\"\",Lots!F205)","v":""},{"$f":"IF(Lots!A205=\"\",\"\",Lots!J205)","v":""},{"$f":"IF(Lots!A205=\"\",\"\",Lots!G205)","v":""},{"$f":"IF(Lots!A205=\"\",\"\",Lots!H205)","v":""},{"$f":"IF(Lots!A205=\"\",\"\",Lots!EA205)","v":""},{"$f":"IF(Lots!A205=\"\",\"\",Lots!EB205)","v":""},{"$f":"IF(Lots!A205=\"\",\"\",Lots!EK205)","v":""},{"$f":"IF(Lots!A205=\"\",\"\",Lots!EF205)","v":""},{"$f":"IF(Lots!F205=\"\",\"\",Lots!EG205)","v":""},{"$f":"IF(Lots!H205=\"\",\"\",Lots!EH205)","v":""},"",{"$f":"IF(A216=\"\",\"\",IF(Lots!ET205=TRUE,\"D\",\"S\"))","v":""},0,0,0,{"$f":"IF(Lots!A205=\"\",\"\",Lots!EM205)","v":""},{"$f":"IF(Lots!A205=\"\",\"\",Lots!EN205)","v":""},{"$f":"IF(Lots!A205=\"\",\"\",Lots!EO205)","v":""},{"$f":"IF(Lots!A205=\"\",\"\",Lots!EP205)","v":""},{"$f":"IF(Lots!A205=\"\",\"\",Lots!EQ205)","v":""},{"$f":"IF(Lots!A205=\"\",\"\",Lots!ER205)","v":""}]
[{"$f":"IF(Lots!A206=\"\",\"\",Lots!A206)","v":""},{"$f":"IF(Lots!A206=\"\",\"\",Lots!F206)","v":""},{"$f":"IF(Lots!A206=\"\",\"\",Lots!J206)","v":""},{"$f":"IF(Lots!A206=\"\",\"\",Lots!G206)","v":""},{"$f":"IF(Lots!A206=\"\",\"\",Lots!H206)","v":""},{"$f":"IF(Lots!A206=\"\",\"\",Lots!EA206)","v":""},{"$f":"IF(Lots!A206=\"\",\"\",Lots!EB206)","v":""},{"$f":"IF(Lots!A206=\"\",\"\",Lots!EK206)","v":""},{"$f":"IF(Lots!A206=\"\",\"\",Lots!EF206)","v":""},{"$f":"IF(Lots!F206=\"\",\"\",Lots!EG206)","v":""},{"$f":"IF(Lots!H206=\"\",\"\",Lots!EH206)","v":""},"",{"$f":"IF(A217=\"\",\"\",IF(Lots!ET206=TRUE,\"D\",\"S\"))","v":""},0,0,0,{"$f":"IF(Lots!A206=\"\",\"\",Lots!EM206)","v":""},{"$f":"IF(Lots!A206=\"\",\"\",Lots!EN206)","v":""},{"$f":"IF(Lots!A206=\"\",\"\",Lots!EO206)","v":""},{"$f":"IF(Lots!A206=\"\",\"\",Lots!EP206)","v":""},{"$f":"IF(Lots!A206=\"\",\"\",Lots!EQ206)","v":""},{"$f":"IF(Lots!A206=\"\",\"\",Lots!ER206)","v":""}]
[{"$f":"IF(Lots!A207=\"\",\"\",Lots!A207)","v":""},{"$f":"IF(Lots!A207=\"\",\"\",Lots!F207)","v":""},{"$f":"IF(Lots!A207=\"\",\"\",Lots!J207)","v":""},{"$f":"IF(Lots!A207=\"\",\"\",Lots!G207)","v":""},{"$f":"IF(Lots!A207=\"\",\"\",Lots!H207)","v":""},{"$f":"IF(Lots!A207=\"\",\"\",Lots!EA207)","v":""},{"$f":"IF(Lots!A207=\"\",\"\",Lots!EB207)","v":""},{"$f":"IF(Lots!A207=\"\",\"\",Lots!EK207)","v":""},{"$f":"IF(Lots!A207=\"\",\"\",Lots!EF207)","v":""},{"$f":"IF(Lots!F207=\"\",\"\",Lots!EG207)","v":""},{"$f":"IF(Lots!H207=\"\",\"\",Lots!EH207)","v":""},{"$f":"IF(A218=\"\",\"\",SUM(J218:K218))","v":""},{"$f":"IF(A218=\"\",\"\",IF(Lots!ET207=TRUE,\"D\",\"S\"))","v":""},{"$f":"IF(A218=\"\",0,$A$8/100*D218*B218)","v":0},{"$f":"IF(A218=\"\",0,$A$8/100*E218*C218)","v":0},{"$f":"IF(I218>50,0,L218)","v":0},{"$f":"IF(Lots!A207=\"\",\"\",Lots!EM207)","v":""},{"$f":"IF(Lots!A207=\"\",\"\",Lots!EN207)","v":""},{"$f":"IF(Lots!A207=\"\",\"\",Lots!EO207)","v":""},{"$f":"IF(Lots!A207=\"\",\"\",Lots!EP207)","v":""},{"$f":"IF(Lots!A207=\"\",\"\",Lots!EQ207)","v":""},{"$f":"IF(Lots!A207=\"\",\"\",Lots!ER207)","v":""}]
[{"$f":"IF(Lots!A208=\"\",\"\",Lots!A208)","v":""},{"$f":"IF(Lots!A208=\"\",\"\",Lots!F208)","v":""},{"$f":"IF(Lots!A208=\"\",\"\",Lots!J208)","v":""},{"$f":"IF(Lots!A208=\"\",\"\",Lots!G208)","v":""},{"$f":"IF(Lots!A208=\"\",\"\",Lots!H208)","v":""},{"$f":"IF(Lots!A208=\"\",\"\",Lots!EA208)","v":""},{"$f":"IF(Lots!A208=\"\",\"\",Lots!EB208)","v":""},{"$f":"IF(Lots!A208=\"\",\"\",Lots!EK208)","v":""},{"$f":"IF(Lots!A208=\"\",\"\",Lots!EF208)","v":""},{"$f":"IF(Lots!F208=\"\",\"\",Lots!EG208)","v":""},{"$f":"IF(Lots!H208=\"\",\"\",Lots!EH208)","v":""},"",{"$f":"IF(A219=\"\",\"\",IF(Lots!ET208=TRUE,\"D\",\"S\"))","v":""},0,0,0,{"$f":"IF(Lots!A208=\"\",\"\",Lots!EM208)","v":""},{"$f":"IF(Lots!A208=\"\",\"\",Lots!EN208)","v":""},{"$f":"IF(Lots!A208=\"\",\"\",Lots!EO208)","v":""},{"$f":"IF(Lots!A208=\"\",\"\",Lots!EP208)","v":""},{"$f":"IF(Lots!A208=\"\",\"\",Lots!EQ208)","v":""},{"$f":"IF(Lots!A208=\"\",\"\",Lots!ER208)","v":""}]
[{"$f":"IF(Lots!A209=\"\",\"\",Lots!A209)","v":""},{"$f":"IF(Lots!A209=\"\",\"\",Lots!F209)","v":""},{"$f":"IF(Lots!A209=\"\",\"\",Lots!J209)","v":""},{"$f":"IF(Lots!A209=\"\",\"\",Lots!G209)","v":""},{"$f":"IF(Lots!A209=\"\",\"\",Lots!H209)","v":""},{"$f":"IF(Lots!A209=\"\",\"\",Lots!EA209)","v":""},{"$f":"IF(Lots!A209=\"\",\"\",Lots!EB209)","v":""},{"$f":"IF(Lots!A209=\"\",\"\",Lots!EK209)","v":""},{"$f":"IF(Lots!A209=\"\",\"\",Lots!EF209)","v":""},{"$f":"IF(Lots!F209=\"\",\"\",Lots!EG209)","v":""},{"$f":"IF(Lots!H209=\"\",\"\",Lots!EH209)","v":""},"",{"$f":"IF(A220=\"\",\"\",IF(Lots!ET209=TRUE,\"D\",\"S\"))","v":""},0,0,0,{"$f":"IF(Lots!A209=\"\",\"\",Lots!EM209)","v":""},{"$f":"IF(Lots!A209=\"\",\"\",Lots!EN209)","v":""},{"$f":"IF(Lots!A209=\"\",\"\",Lots!EO209)","v":""},{"$f":"IF(Lots!A209=\"\",\"\",Lots!EP209)","v":""},{"$f":"IF(Lots!A209=\"\",\"\",Lots!EQ209)","v":""},{"$f":"IF(Lots!A209=\"\",\"\",Lots!ER209)","v":""}]
[{"$f":"IF(Lots!A210=\"\",\"\",Lots!A210)","v":""},{"$f":"IF(Lots!A210=\"\",\"\",Lots!F210)","v":""},{"$f":"IF(Lots!A210=\"\",\"\",Lots!J210)","v":""},{"$f":"IF(Lots!A210=\"\",\"\",Lots!G210)","v":""},{"$f":"IF(Lots!A210=\"\",\"\",Lots!H210)","v":""},{"$f":"IF(Lots!A210=\"\",\"\",Lots!EA210)","v":""},{"$f":"IF(Lots!A210=\"\",\"\",Lots!EB210)","v":""},{"$f":"IF(Lots!A210=\"\",\"\",Lots!EK210)","v":""},{"$f":"IF(Lots!A210=\"\",\"\",Lots!EF210)","v":""},{"$f":"IF(Lots!F210=\"\",\"\",Lots!EG210)","v":""},{"$f":"IF(Lots!H210=\"\",\"\",Lots!EH210)","v":""},"",{"$f":"IF(A221=\"\",\"\",IF(Lots!ET210=TRUE,\"D\",\"S\"))","v":""},0,0,0,{"$f":"IF(Lots!A210=\"\",\"\",Lots!EM210)","v":""},{"$f":"IF(Lots!A210=\"\",\"\",Lots!EN210)","v":""},{"$f":"IF(Lots!A210=\"\",\"\",Lots!EO210)","v":""},{"$f":"IF(Lots!A210=\"\",\"\",Lots!EP210)","v":""},{"$f":"IF(Lots!A210=\"\",\"\",Lots!EQ210)","v":""},{"$f":"IF(Lots!A210=\"\",\"\",Lots!ER210)","v":""}]
[{"$f":"IF(Lots!A211=\"\",\"\",Lots!A211)","v":""},{"$f":"IF(Lots!A211=\"\",\"\",Lots!F211)","v":""},{"$f":"IF(Lots!A211=\"\",\"\",Lots!J211)","v":""},{"$f":"IF(Lots!A211=\"\",\"\",Lots!G211)","v":""},{"$f":"IF(Lots!A211=\"\",\"\",Lots!H211)","v":""},{"$f":"IF(Lots!A211=\"\",\"\",Lots!EA211)","v":""},{"$f":"IF(Lots!A211=\"\",\"\",Lots!EB211)","v":""},{"$f":"IF(Lots!A211=\"\",\"\",Lots!EK211)","v":""},{"$f":"IF(Lots!A211=\"\",\"\",Lots!EF211)","v":""},{"$f":"IF(Lots!F211=\"\",\"\",Lots!EG211)","v":""},{"$f":"IF(Lots!H211=\"\",\"\",Lots!EH211)","v":""},"",{"$f":"IF(A222=\"\",\"\",IF(Lots!ET211=TRUE,\"D\",\"S\"))","v":""},0,0,0,{"$f":"IF(Lots!A211=\"\",\"\",Lots!EM211)","v":""},{"$f":"IF(Lots!A211=\"\",\"\",Lots!EN211)","v":""},{"$f":"IF(Lots!A211=\"\",\"\",Lots!EO211)","v":""},{"$f":"IF(Lots!A211=\"\",\"\",Lots!EP211)","v":""},{"$f":"IF(Lots!A211=\"\",\"\",Lots!EQ211)","v":""},{"$f":"IF(Lots!A211=\"\",\"\",Lots!ER211)","v":""}]
[{"$f":"IF(Lots!A212=\"\",\"\",Lots!A212)","v":""},{"$f":"IF(Lots!A212=\"\",\"\",Lots!F212)","v":""},{"$f":"IF(Lots!A212=\"\",\"\",Lots!J212)","v":""},{"$f":"IF(Lots!A212=\"\",\"\",Lots!G212)","v":""},{"$f":"IF(Lots!A212=\"\",\"\",Lots!H212)","v":""},{"$f":"IF(Lots!A212=\"\",\"\",Lots!EA212)","v":""},{"$f":"IF(Lots!A212=\"\",\"\",Lots!EB212)","v":""},{"$f":"IF(Lots!A212=\"\",\"\",Lots!EK212)","v":""},{"$f":"IF(Lots!A212=\"\",\"\",Lots!EF212)","v":""},{"$f":"IF(Lots!F212=\"\",\"\",Lots!EG212)","v":""},{"$f":"IF(Lots!H212=\"\",\"\",Lots!EH212)","v":""},"",{"$f":"IF(A223=\"\",\"\",IF(Lots!ET212=TRUE,\"D\",\"S\"))","v":""},0,0,0,{"$f":"IF(Lots!A212=\"\",\"\",Lots!EM212)","v":""},{"$f":"IF(Lots!A212=\"\",\"\",Lots!EN212)","v":""},{"$f":"IF(Lots!A212=\"\",\"\",Lots!EO212)","v":""},{"$f":"IF(Lots!A212=\"\",\"\",Lots!EP212)","v":""},{"$f":"IF(Lots!A212=\"\",\"\",Lots!EQ212)","v":""},{"$f":"IF(Lots!A212=\"\",\"\",Lots!ER212)","v":""}]
[{"$f":"IF(Lots!A213=\"\",\"\",Lots!A213)","v":""},{"$f":"IF(Lots!A213=\"\",\"\",Lots!F213)","v":""},{"$f":"IF(Lots!A213=\"\",\"\",Lots!J213)","v":""},{"$f":"IF(Lots!A213=\"\",\"\",Lots!G213)","v":""},{"$f":"IF(Lots!A213=\"\",\"\",Lots!H213)","v":""},{"$f":"IF(Lots!A213=\"\",\"\",Lots!EA213)","v":""},{"$f":"IF(Lots!A213=\"\",\"\",Lots!EB213)","v":""},{"$f":"IF(Lots!A213=\"\",\"\",Lots!EK213)","v":""},{"$f":"IF(Lots!A213=\"\",\"\",Lots!EF213)","v":""},{"$f":"IF(Lots!F213=\"\",\"\",Lots!EG213)","v":""},{"$f":"IF(Lots!H213=\"\",\"\",Lots!EH213)","v":""},"",{"$f":"IF(A224=\"\",\"\",IF(Lots!ET213=TRUE,\"D\",\"S\"))","v":""},0,0,0,{"$f":"IF(Lots!A213=\"\",\"\",Lots!EM213)","v":""},{"$f":"IF(Lots!A213=\"\",\"\",Lots!EN213)","v":""},{"$f":"IF(Lots!A213=\"\",\"\",Lots!EO213)","v":""},{"$f":"IF(Lots!A213=\"\",\"\",Lots!EP213)","v":""},{"$f":"IF(Lots!A213=\"\",\"\",Lots!EQ213)","v":""},{"$f":"IF(Lots!A213=\"\",\"\",Lots!ER213)","v":""}]
[{"$f":"IF(Lots!A214=\"\",\"\",Lots!A214)","v":""},{"$f":"IF(Lots!A214=\"\",\"\",Lots!F214)","v":""},{"$f":"IF(Lots!A214=\"\",\"\",Lots!J214)","v":""},{"$f":"IF(Lots!A214=\"\",\"\",Lots!G214)","v":""},{"$f":"IF(Lots!A214=\"\",\"\",Lots!H214)","v":""},{"$f":"IF(Lots!A214=\"\",\"\",Lots!EA214)","v":""},{"$f":"IF(Lots!A214=\"\",\"\",Lots!EB214)","v":""},{"$f":"IF(Lots!A214=\"\",\"\",Lots!EK214)","v":""},{"$f":"IF(Lots!A214=\"\",\"\",Lots!EF214)","v":""},{"$f":"IF(Lots!F214=\"\",\"\",Lots!EG214)","v":""},{"$f":"IF(Lots!H214=\"\",\"\",Lots!EH214)","v":""},"",{"$f":"IF(A225=\"\",\"\",IF(Lots!ET214=TRUE,\"D\",\"S\"))","v":""},0,0,0,{"$f":"IF(Lots!A214=\"\",\"\",Lots!EM214)","v":""},{"$f":"IF(Lots!A214=\"\",\"\",Lots!EN214)","v":""},{"$f":"IF(Lots!A214=\"\",\"\",Lots!EO214)","v":""},{"$f":"IF(Lots!A214=\"\",\"\",Lots!EP214)","v":""},{"$f":"IF(Lots!A214=\"\",\"\",Lots!EQ214)","v":""},{"$f":"IF(Lots!A214=\"\",\"\",Lots!ER214)","v":""}]
[{"$f":"IF(Lots!A215=\"\",\"\",Lots!A215)","v":""},{"$f":"IF(Lots!A215=\"\",\"\",Lots!F215)","v":""},{"$f":"IF(Lots!A215=\"\",\"\",Lots!J215)","v":""},{"$f":"IF(Lots!A215=\"\",\"\",Lots!G215)","v":""},{"$f":"IF(Lots!A215=\"\",\"\",Lots!H215)","v":""},{"$f":"IF(Lots!A215=\"\",\"\",Lots!EA215)","v":""},{"$f":"IF(Lots!A215=\"\",\"\",Lots!EB215)","v":""},{"$f":"IF(Lots!A215=\"\",\"\",Lots!EK215)","v":""},{"$f":"IF(Lots!A215=\"\",\"\",Lots!EF215)","v":""},{"$f":"IF(Lots!F215=\"\",\"\",Lots!EG215)","v":""},{"$f":"IF(Lots!H215=\"\",\"\",Lots!EH215)","v":""},"",{"$f":"IF(A226=\"\",\"\",IF(Lots!ET215=TRUE,\"D\",\"S\"))","v":""},0,0,0,{"$f":"IF(Lots!A215=\"\",\"\",Lots!EM215)","v":""},{"$f":"IF(Lots!A215=\"\",\"\",Lots!EN215)","v":""},{"$f":"IF(Lots!A215=\"\",\"\",Lots!EO215)","v":""},{"$f":"IF(Lots!A215=\"\",\"\",Lots!EP215)","v":""},{"$f":"IF(Lots!A215=\"\",\"\",Lots!EQ215)","v":""},{"$f":"IF(Lots!A215=\"\",\"\",Lots!ER215)","v":""}]
[{"$f":"IF(Lots!A216=\"\",\"\",Lots!A216)","v":""},{"$f":"IF(Lots!A216=\"\",\"\",Lots!F216)","v":""},{"$f":"IF(Lots!A216=\"\",\"\",Lots!J216)","v":""},{"$f":"IF(Lots!A216=\"\",\"\",Lots!G216)","v":""},{"$f":"IF(Lots!A216=\"\",\"\",Lots!H216)","v":""},{"$f":"IF(Lots!A216=\"\",\"\",Lots!EA216)","v":""},{"$f":"IF(Lots!A216=\"\",\"\",Lots!EB216)","v":""},{"$f":"IF(Lots!A216=\"\",\"\",Lots!EK216)","v":""},{"$f":"IF(Lots!A216=\"\",\"\",Lots!EF216)","v":""},{"$f":"IF(Lots!F216=\"\",\"\",Lots!EG216)","v":""},{"$f":"IF(Lots!H216=\"\",\"\",Lots!EH216)","v":""},"",{"$f":"IF(A227=\"\",\"\",IF(Lots!ET216=TRUE,\"D\",\"S\"))","v":""},0,0,0,{"$f":"IF(Lots!A216=\"\",\"\",Lots!EM216)","v":""},{"$f":"IF(Lots!A216=\"\",\"\",Lots!EN216)","v":""},{"$f":"IF(Lots!A216=\"\",\"\",Lots!EO216)","v":""},{"$f":"IF(Lots!A216=\"\",\"\",Lots!EP216)","v":""},{"$f":"IF(Lots!A216=\"\",\"\",Lots!EQ216)","v":""},{"$f":"IF(Lots!A216=\"\",\"\",Lots!ER216)","v":""}]
[{"$f":"IF(Lots!A217=\"\",\"\",Lots!A217)","v":""},{"$f":"IF(Lots!A217=\"\",\"\",Lots!F217)","v":""},{"$f":"IF(Lots!A217=\"\",\"\",Lots!J217)","v":""},{"$f":"IF(Lots!A217=\"\",\"\",Lots!G217)","v":""},{"$f":"IF(Lots!A217=\"\",\"\",Lots!H217)","v":""},{"$f":"IF(Lots!A217=\"\",\"\",Lots!EA217)","v":""},{"$f":"IF(Lots!A217=\"\",\"\",Lots!EB217)","v":""},{"$f":"IF(Lots!A217=\"\",\"\",Lots!EK217)","v":""},{"$f":"IF(Lots!A217=\"\",\"\",Lots!EF217)","v":""},{"$f":"IF(Lots!F217=\"\",\"\",Lots!EG217)","v":""},{"$f":"IF(Lots!H217=\"\",\"\",Lots!EH217)","v":""},"",{"$f":"IF(A228=\"\",\"\",IF(Lots!ET217=TRUE,\"D\",\"S\"))","v":""},0,0,0,{"$f":"IF(Lots!A217=\"\",\"\",Lots!EM217)","v":""},{"$f":"IF(Lots!A217=\"\",\"\",Lots!EN217)","v":""},{"$f":"IF(Lots!A217=\"\",\"\",Lots!EO217)","v":""},{"$f":"IF(Lots!A217=\"\",\"\",Lots!EP217)","v":""},{"$f":"IF(Lots!A217=\"\",\"\",Lots!EQ217)","v":""},{"$f":"IF(Lots!A217=\"\",\"\",Lots!ER217)","v":""}]
[{"$f":"IF(Lots!A218=\"\",\"\",Lots!A218)","v":""},{"$f":"IF(Lots!A218=\"\",\"\",Lots!F218)","v":""},{"$f":"IF(Lots!A218=\"\",\"\",Lots!J218)","v":""},{"$f":"IF(Lots!A218=\"\",\"\",Lots!G218)","v":""},{"$f":"IF(Lots!A218=\"\",\"\",Lots!H218)","v":""},{"$f":"IF(Lots!A218=\"\",\"\",Lots!EA218)","v":""},{"$f":"IF(Lots!A218=\"\",\"\",Lots!EB218)","v":""},{"$f":"IF(Lots!A218=\"\",\"\",Lots!EK218)","v":""},{"$f":"IF(Lots!A218=\"\",\"\",Lots!EF218)","v":""},{"$f":"IF(Lots!F218=\"\",\"\",Lots!EG218)","v":""},{"$f":"IF(Lots!H218=\"\",\"\",Lots!EH218)","v":""},"",{"$f":"IF(A229=\"\",\"\",IF(Lots!ET218=TRUE,\"D\",\"S\"))","v":""},0,0,0,{"$f":"IF(Lots!A218=\"\",\"\",Lots!EM218)","v":""},{"$f":"IF(Lots!A218=\"\",\"\",Lots!EN218)","v":""},{"$f":"IF(Lots!A218=\"\",\"\",Lots!EO218)","v":""},{"$f":"IF(Lots!A218=\"\",\"\",Lots!EP218)","v":""},{"$f":"IF(Lots!A218=\"\",\"\",Lots!EQ218)","v":""},{"$f":"IF(Lots!A218=\"\",\"\",Lots!ER218)","v":""}]
[{"$f":"IF(Lots!A219=\"\",\"\",Lots!A219)","v":""},{"$f":"IF(Lots!A219=\"\",\"\",Lots!F219)","v":""},{"$f":"IF(Lots!A219=\"\",\"\",Lots!J219)","v":""},{"$f":"IF(Lots!A219=\"\",\"\",Lots!G219)","v":""},{"$f":"IF(Lots!A219=\"\",\"\",Lots!H219)","v":""},{"$f":"IF(Lots!A219=\"\",\"\",Lots!EA219)","v":""},{"$f":"IF(Lots!A219=\"\",\"\",Lots!EB219)","v":""},{"$f":"IF(Lots!A219=\"\",\"\",Lots!EK219)","v":""},{"$f":"IF(Lots!A219=\"\",\"\",Lots!EF219)","v":""},{"$f":"IF(Lots!F219=\"\",\"\",Lots!EG219)","v":""},{"$f":"IF(Lots!H219=\"\",\"\",Lots!EH219)","v":""},"",{"$f":"IF(A230=\"\",\"\",IF(Lots!ET219=TRUE,\"D\",\"S\"))","v":""},0,0,0,{"$f":"IF(Lots!A219=\"\",\"\",Lots!EM219)","v":""},{"$f":"IF(Lots!A219=\"\",\"\",Lots!EN219)","v":""},{"$f":"IF(Lots!A219=\"\",\"\",Lots!EO219)","v":""},{"$f":"IF(Lots!A219=\"\",\"\",Lots!EP219)","v":""},{"$f":"IF(Lots!A219=\"\",\"\",Lots!EQ219)","v":""},{"$f":"IF(Lots!A219=\"\",\"\",Lots!ER219)","v":""}]
[{"$f":"IF(Lots!A220=\"\",\"\",Lots!A220)","v":""},{"$f":"IF(Lots!A220=\"\",\"\",Lots!F220)","v":""},{"$f":"IF(Lots!A220=\"\",\"\",Lots!J220)","v":""},{"$f":"IF(Lots!A220=\"\",\"\",Lots!G220)","v":""},{"$f":"IF(Lots!A220=\"\",\"\",Lots!H220)","v":""},{"$f":"IF(Lots!A220=\"\",\"\",Lots!EA220)","v":""},{"$f":"IF(Lots!A220=\"\",\"\",Lots!EB220)","v":""},{"$f":"IF(Lots!A220=\"\",\"\",Lots!EK220)","v":""},{"$f":"IF(Lots!A220=\"\",\"\",Lots!EF220)","v":""},{"$f":"IF(Lots!F220=\"\",\"\",Lots!EG220)","v":""},{"$f":"IF(Lots!H220=\"\",\"\",Lots!EH220)","v":""},"",{"$f":"IF(A231=\"\",\"\",IF(Lots!ET220=TRUE,\"D\",\"S\"))","v":""},0,0,0,{"$f":"IF(Lots!A220=\"\",\"\",Lots!EM220)","v":""},{"$f":"IF(Lots!A220=\"\",\"\",Lots!EN220)","v":""},{"$f":"IF(Lots!A220=\"\",\"\",Lots!EO220)","v":""},{"$f":"IF(Lots!A220=\"\",\"\",Lots!EP220)","v":""},{"$f":"IF(Lots!A220=\"\",\"\",Lots!EQ220)","v":""},{"$f":"IF(Lots!A220=\"\",\"\",Lots!ER220)","v":""}]
[{"$f":"IF(Lots!A221=\"\",\"\",Lots!A221)","v":""},{"$f":"IF(Lots!A221=\"\",\"\",Lots!F221)","v":""},{"$f":"IF(Lots!A221=\"\",\"\",Lots!J221)","v":""},{"$f":"IF(Lots!A221=\"\",\"\",Lots!G221)","v":""},{"$f":"IF(Lots!A221=\"\",\"\",Lots!H221)","v":""},{"$f":"IF(Lots!A221=\"\",\"\",Lots!EA221)","v":""},{"$f":"IF(Lots!A221=\"\",\"\",Lots!EB221)","v":""},{"$f":"IF(Lots!A221=\"\",\"\",Lots!EK221)","v":""},{"$f":"IF(Lots!A221=\"\",\"\",Lots!EF221)","v":""},{"$f":"IF(Lots!F221=\"\",\"\",Lots!EG221)","v":""},{"$f":"IF(Lots!H221=\"\",\"\",Lots!EH221)","v":""},"",{"$f":"IF(A232=\"\",\"\",IF(Lots!ET221=TRUE,\"D\",\"S\"))","v":""},0,0,0,{"$f":"IF(Lots!A221=\"\",\"\",Lots!EM221)","v":""},{"$f":"IF(Lots!A221=\"\",\"\",Lots!EN221)","v":""},{"$f":"IF(Lots!A221=\"\",\"\",Lots!EO221)","v":""},{"$f":"IF(Lots!A221=\"\",\"\",Lots!EP221)","v":""},{"$f":"IF(Lots!A221=\"\",\"\",Lots!EQ221)","v":""},{"$f":"IF(Lots!A221=\"\",\"\",Lots!ER221)","v":""}]
[{"$f":"IF(Lots!A222=\"\",\"\",Lots!A222)","v":""},{"$f":"IF(Lots!A222=\"\",\"\",Lots!F222)","v":""},{"$f":"IF(Lots!A222=\"\",\"\",Lots!J222)","v":""},{"$f":"IF(Lots!A222=\"\",\"\",Lots!G222)","v":""},{"$f":"IF(Lots!A222=\"\",\"\",Lots!H222)","v":""},{"$f":"IF(Lots!A222=\"\",\"\",Lots!EA222)","v":""},{"$f":"IF(Lots!A222=\"\",\"\",Lots!EB222)","v":""},{"$f":"IF(Lots!A222=\"\",\"\",Lots!EK222)","v":""},{"$f":"IF(Lots!A222=\"\",\"\",Lots!EF222)","v":""},{"$f":"IF(Lots!F222=\"\",\"\",Lots!EG222)","v":""},{"$f":"IF(Lots!H222=\"\",\"\",Lots!EH222)","v":""},"",{"$f":"IF(A233=\"\",\"\",IF(Lots!ET222=TRUE,\"D\",\"S\"))","v":""},0,0,0,{"$f":"IF(Lots!A222=\"\",\"\",Lots!EM222)","v":""},{"$f":"IF(Lots!A222=\"\",\"\",Lots!EN222)","v":""},{"$f":"IF(Lots!A222=\"\",\"\",Lots!EO222)","v":""},{"$f":"IF(Lots!A222=\"\",\"\",Lots!EP222)","v":""},{"$f":"IF(Lots!A222=\"\",\"\",Lots!EQ222)","v":""},{"$f":"IF(Lots!A222=\"\",\"\",Lots!ER222)","v":""}]
[{"$f":"IF(Lots!A223=\"\",\"\",Lots!A223)","v":""},{"$f":"IF(Lots!A223=\"\",\"\",Lots!F223)","v":""},{"$f":"IF(Lots!A223=\"\",\"\",Lots!J223)","v":""},{"$f":"IF(Lots!A223=\"\",\"\",Lots!G223)","v":""},{"$f":"IF(Lots!A223=\"\",\"\",Lots!H223)","v":""},{"$f":"IF(Lots!A223=\"\",\"\",Lots!EA223)","v":""},{"$f":"IF(Lots!A223=\"\",\"\",Lots!EB223)","v":""},{"$f":"IF(Lots!A223=\"\",\"\",Lots!EK223)","v":""},{"$f":"IF(Lots!A223=\"\",\"\",Lots!EF223)","v":""},{"$f":"IF(Lots!F223=\"\",\"\",Lots!EG223)","v":""},{"$f":"IF(Lots!H223=\"\",\"\",Lots!EH223)","v":""},"",{"$f":"IF(A234=\"\",\"\",IF(Lots!ET223=TRUE,\"D\",\"S\"))","v":""},0,0,0,{"$f":"IF(Lots!A223=\"\",\"\",Lots!EM223)","v":""},{"$f":"IF(Lots!A223=\"\",\"\",Lots!EN223)","v":""},{"$f":"IF(Lots!A223=\"\",\"\",Lots!EO223)","v":""},{"$f":"IF(Lots!A223=\"\",\"\",Lots!EP223)","v":""},{"$f":"IF(Lots!A223=\"\",\"\",Lots!EQ223)","v":""},{"$f":"IF(Lots!A223=\"\",\"\",Lots!ER223)","v":""}]
[{"$f":"IF(Lots!A224=\"\",\"\",Lots!A224)","v":""},{"$f":"IF(Lots!A224=\"\",\"\",Lots!F224)","v":""},{"$f":"IF(Lots!A224=\"\",\"\",Lots!J224)","v":""},{"$f":"IF(Lots!A224=\"\",\"\",Lots!G224)","v":""},{"$f":"IF(Lots!A224=\"\",\"\",Lots!H224)","v":""},{"$f":"IF(Lots!A224=\"\",\"\",Lots!EA224)","v":""},{"$f":"IF(Lots!A224=\"\",\"\",Lots!EB224)","v":""},{"$f":"IF(Lots!A224=\"\",\"\",Lots!EK224)","v":""},{"$f":"IF(Lots!A224=\"\",\"\",Lots!EF224)","v":""},{"$f":"IF(Lots!F224=\"\",\"\",Lots!EG224)","v":""},{"$f":"IF(Lots!H224=\"\",\"\",Lots!EH224)","v":""},"",{"$f":"IF(A235=\"\",\"\",IF(Lots!ET224=TRUE,\"D\",\"S\"))","v":""},0,0,0,{"$f":"IF(Lots!A224=\"\",\"\",Lots!EM224)","v":""},{"$f":"IF(Lots!A224=\"\",\"\",Lots!EN224)","v":""},{"$f":"IF(Lots!A224=\"\",\"\",Lots!EO224)","v":""},{"$f":"IF(Lots!A224=\"\",\"\",Lots!EP224)","v":""},{"$f":"IF(Lots!A224=\"\",\"\",Lots!EQ224)","v":""},{"$f":"IF(Lots!A224=\"\",\"\",Lots!ER224)","v":""}]
[{"$f":"IF(Lots!A225=\"\",\"\",Lots!A225)","v":""},{"$f":"IF(Lots!A225=\"\",\"\",Lots!F225)","v":""},{"$f":"IF(Lots!A225=\"\",\"\",Lots!J225)","v":""},{"$f":"IF(Lots!A225=\"\",\"\",Lots!G225)","v":""},{"$f":"IF(Lots!A225=\"\",\"\",Lots!H225)","v":""},{"$f":"IF(Lots!A225=\"\",\"\",Lots!EA225)","v":""},{"$f":"IF(Lots!A225=\"\",\"\",Lots!EB225)","v":""},{"$f":"IF(Lots!A225=\"\",\"\",Lots!EK225)","v":""},{"$f":"IF(Lots!A225=\"\",\"\",Lots!EF225)","v":""},{"$f":"IF(Lots!F225=\"\",\"\",Lots!EG225)","v":""},{"$f":"IF(Lots!H225=\"\",\"\",Lots!EH225)","v":""},"",{"$f":"IF(A236=\"\",\"\",IF(Lots!ET225=TRUE,\"D\",\"S\"))","v":""},0,0,0,{"$f":"IF(Lots!A225=\"\",\"\",Lots!EM225)","v":""},{"$f":"IF(Lots!A225=\"\",\"\",Lots!EN225)","v":""},{"$f":"IF(Lots!A225=\"\",\"\",Lots!EO225)","v":""},{"$f":"IF(Lots!A225=\"\",\"\",Lots!EP225)","v":""},{"$f":"IF(Lots!A225=\"\",\"\",Lots!EQ225)","v":""},{"$f":"IF(Lots!A225=\"\",\"\",Lots!ER225)","v":""}]
[{"$f":"IF(Lots!A226=\"\",\"\",Lots!A226)","v":""},{"$f":"IF(Lots!A226=\"\",\"\",Lots!F226)","v":""},{"$f":"IF(Lots!A226=\"\",\"\",Lots!J226)","v":""},{"$f":"IF(Lots!A226=\"\",\"\",Lots!G226)","v":""},{"$f":"IF(Lots!A226=\"\",\"\",Lots!H226)","v":""},{"$f":"IF(Lots!A226=\"\",\"\",Lots!EA226)","v":""},{"$f":"IF(Lots!A226=\"\",\"\",Lots!EB226)","v":""},{"$f":"IF(Lots!A226=\"\",\"\",Lots!EK226)","v":""},{"$f":"IF(Lots!A226=\"\",\"\",Lots!EF226)","v":""},{"$f":"IF(Lots!F226=\"\",\"\",Lots!EG226)","v":""},{"$f":"IF(Lots!H226=\"\",\"\",Lots!EH226)","v":""},"",{"$f":"IF(A237=\"\",\"\",IF(Lots!ET226=TRUE,\"D\",\"S\"))","v":""},0,0,0,{"$f":"IF(Lots!A226=\"\",\"\",Lots!EM226)","v":""},{"$f":"IF(Lots!A226=\"\",\"\",Lots!EN226)","v":""},{"$f":"IF(Lots!A226=\"\",\"\",Lots!EO226)","v":""},{"$f":"IF(Lots!A226=\"\",\"\",Lots!EP226)","v":""},{"$f":"IF(Lots!A226=\"\",\"\",Lots!EQ226)","v":""},{"$f":"IF(Lots!A226=\"\",\"\",Lots!ER226)","v":""}]
[{"$f":"IF(Lots!A227=\"\",\"\",Lots!A227)","v":""},{"$f":"IF(Lots!A227=\"\",\"\",Lots!F227)","v":""},{"$f":"IF(Lots!A227=\"\",\"\",Lots!J227)","v":""},{"$f":"IF(Lots!A227=\"\",\"\",Lots!G227)","v":""},{"$f":"IF(Lots!A227=\"\",\"\",Lots!H227)","v":""},{"$f":"IF(Lots!A227=\"\",\"\",Lots!EA227)","v":""},{"$f":"IF(Lots!A227=\"\",\"\",Lots!EB227)","v":""},{"$f":"IF(Lots!A227=\"\",\"\",Lots!EK227)","v":""},{"$f":"IF(Lots!A227=\"\",\"\",Lots!EF227)","v":""},{"$f":"IF(Lots!F227=\"\",\"\",Lots!EG227)","v":""},{"$f":"IF(Lots!H227=\"\",\"\",Lots!EH227)","v":""},"",{"$f":"IF(A238=\"\",\"\",IF(Lots!ET227=TRUE,\"D\",\"S\"))","v":""},0,0,0,{"$f":"IF(Lots!A227=\"\",\"\",Lots!EM227)","v":""},{"$f":"IF(Lots!A227=\"\",\"\",Lots!EN227)","v":""},{"$f":"IF(Lots!A227=\"\",\"\",Lots!EO227)","v":""},{"$f":"IF(Lots!A227=\"\",\"\",Lots!EP227)","v":""},{"$f":"IF(Lots!A227=\"\",\"\",Lots!EQ227)","v":""},{"$f":"IF(Lots!A227=\"\",\"\",Lots!ER227)","v":""}]
[{"$f":"IF(Lots!A228=\"\",\"\",Lots!A228)","v":""},{"$f":"IF(Lots!A228=\"\",\"\",Lots!F228)","v":""},{"$f":"IF(Lots!A228=\"\",\"\",Lots!J228)","v":""},{"$f":"IF(Lots!A228=\"\",\"\",Lots!G228)","v":""},{"$f":"IF(Lots!A228=\"\",\"\",Lots!H228)","v":""},{"$f":"IF(Lots!A228=\"\",\"\",Lots!EA228)","v":""},{"$f":"IF(Lots!A228=\"\",\"\",Lots!EB228)","v":""},{"$f":"IF(Lots!A228=\"\",\"\",Lots!EK228)","v":""},{"$f":"IF(Lots!A228=\"\",\"\",Lots!EF228)","v":""},{"$f":"IF(Lots!F228=\"\",\"\",Lots!EG228)","v":""},{"$f":"IF(Lots!H228=\"\",\"\",Lots!EH228)","v":""},"",{"$f":"IF(A239=\"\",\"\",IF(Lots!ET228=TRUE,\"D\",\"S\"))","v":""},0,0,0,{"$f":"IF(Lots!A228=\"\",\"\",Lots!EM228)","v":""},{"$f":"IF(Lots!A228=\"\",\"\",Lots!EN228)","v":""},{"$f":"IF(Lots!A228=\"\",\"\",Lots!EO228)","v":""},{"$f":"IF(Lots!A228=\"\",\"\",Lots!EP228)","v":""},{"$f":"IF(Lots!A228=\"\",\"\",Lots!EQ228)","v":""},{"$f":"IF(Lots!A228=\"\",\"\",Lots!ER228)","v":""}]
[{"$f":"IF(Lots!A229=\"\",\"\",Lots!A229)","v":""},{"$f":"IF(Lots!A229=\"\",\"\",Lots!F229)","v":""},{"$f":"IF(Lots!A229=\"\",\"\",Lots!J229)","v":""},{"$f":"IF(Lots!A229=\"\",\"\",Lots!G229)","v":""},{"$f":"IF(Lots!A229=\"\",\"\",Lots!H229)","v":""},{"$f":"IF(Lots!A229=\"\",\"\",Lots!EA229)","v":""},{"$f":"IF(Lots!A229=\"\",\"\",Lots!EB229)","v":""},{"$f":"IF(Lots!A229=\"\",\"\",Lots!EK229)","v":""},{"$f":"IF(Lots!A229=\"\",\"\",Lots!EF229)","v":""},{"$f":"IF(Lots!F229=\"\",\"\",Lots!EG229)","v":""},{"$f":"IF(Lots!H229=\"\",\"\",Lots!EH229)","v":""},"",{"$f":"IF(A240=\"\",\"\",IF(Lots!ET229=TRUE,\"D\",\"S\"))","v":""},0,0,0,{"$f":"IF(Lots!A229=\"\",\"\",Lots!EM229)","v":""},{"$f":"IF(Lots!A229=\"\",\"\",Lots!EN229)","v":""},{"$f":"IF(Lots!A229=\"\",\"\",Lots!EO229)","v":""},{"$f":"IF(Lots!A229=\"\",\"\",Lots!EP229)","v":""},{"$f":"IF(Lots!A229=\"\",\"\",Lots!EQ229)","v":""},{"$f":"IF(Lots!A229=\"\",\"\",Lots!ER229)","v":""}]
[{"$f":"IF(Lots!A230=\"\",\"\",Lots!A230)","v":""},{"$f":"IF(Lots!A230=\"\",\"\",Lots!F230)","v":""},{"$f":"IF(Lots!A230=\"\",\"\",Lots!J230)","v":""},{"$f":"IF(Lots!A230=\"\",\"\",Lots!G230)","v":""},{"$f":"IF(Lots!A230=\"\",\"\",Lots!H230)","v":""},{"$f":"IF(Lots!A230=\"\",\"\",Lots!EA230)","v":""},{"$f":"IF(Lots!A230=\"\",\"\",Lots!EB230)","v":""},{"$f":"IF(Lots!A230=\"\",\"\",Lots!EK230)","v":""},{"$f":"IF(Lots!A230=\"\",\"\",Lots!EF230)","v":""},{"$f":"IF(Lots!F230=\"\",\"\",Lots!EG230)","v":""},{"$f":"IF(Lots!H230=\"\",\"\",Lots!EH230)","v":""},"",{"$f":"IF(A241=\"\",\"\",IF(Lots!ET230=TRUE,\"D\",\"S\"))","v":""},0,0,0,{"$f":"IF(Lots!A230=\"\",\"\",Lots!EM230)","v":""},{"$f":"IF(Lots!A230=\"\",\"\",Lots!EN230)","v":""},{"$f":"IF(Lots!A230=\"\",\"\",Lots!EO230)","v":""},{"$f":"IF(Lots!A230=\"\",\"\",Lots!EP230)","v":""},{"$f":"IF(Lots!A230=\"\",\"\",Lots!EQ230)","v":""},{"$f":"IF(Lots!A230=\"\",\"\",Lots!ER230)","v":""}]
[{"$f":"IF(Lots!A231=\"\",\"\",Lots!A231)","v":""},{"$f":"IF(Lots!A231=\"\",\"\",Lots!F231)","v":""},{"$f":"IF(Lots!A231=\"\",\"\",Lots!J231)","v":""},{"$f":"IF(Lots!A231=\"\",\"\",Lots!G231)","v":""},{"$f":"IF(Lots!A231=\"\",\"\",Lots!H231)","v":""},{"$f":"IF(Lots!A231=\"\",\"\",Lots!EA231)","v":""},{"$f":"IF(Lots!A231=\"\",\"\",Lots!EB231)","v":""},{"$f":"IF(Lots!A231=\"\",\"\",Lots!EK231)","v":""},{"$f":"IF(Lots!A231=\"\",\"\",Lots!EF231)","v":""},{"$f":"IF(Lots!F231=\"\",\"\",Lots!EG231)","v":""},{"$f":"IF(Lots!H231=\"\",\"\",Lots!EH231)","v":""},"",{"$f":"IF(A242=\"\",\"\",IF(Lots!ET231=TRUE,\"D\",\"S\"))","v":""},0,0,0,{"$f":"IF(Lots!A231=\"\",\"\",Lots!EM231)","v":""},{"$f":"IF(Lots!A231=\"\",\"\",Lots!EN231)","v":""},{"$f":"IF(Lots!A231=\"\",\"\",Lots!EO231)","v":""},{"$f":"IF(Lots!A231=\"\",\"\",Lots!EP231)","v":""},{"$f":"IF(Lots!A231=\"\",\"\",Lots!EQ231)","v":""},{"$f":"IF(Lots!A231=\"\",\"\",Lots!ER231)","v":""}]
[{"$f":"IF(Lots!A232=\"\",\"\",Lots!A232)","v":""},{"$f":"IF(Lots!A232=\"\",\"\",Lots!F232)","v":""},{"$f":"IF(Lots!A232=\"\",\"\",Lots!J232)","v":""},{"$f":"IF(Lots!A232=\"\",\"\",Lots!G232)","v":""},{"$f":"IF(Lots!A232=\"\",\"\",Lots!H232)","v":""},{"$f":"IF(Lots!A232=\"\",\"\",Lots!EA232)","v":""},{"$f":"IF(Lots!A232=\"\",\"\",Lots!EB232)","v":""},{"$f":"IF(Lots!A232=\"\",\"\",Lots!EK232)","v":""},{"$f":"IF(Lots!A232=\"\",\"\",Lots!EF232)","v":""},{"$f":"IF(Lots!F232=\"\",\"\",Lots!EG232)","v":""},{"$f":"IF(Lots!H232=\"\",\"\",Lots!EH232)","v":""},"",{"$f":"IF(A243=\"\",\"\",IF(Lots!ET232=TRUE,\"D\",\"S\"))","v":""},0,0,0,{"$f":"IF(Lots!A232=\"\",\"\",Lots!EM232)","v":""},{"$f":"IF(Lots!A232=\"\",\"\",Lots!EN232)","v":""},{"$f":"IF(Lots!A232=\"\",\"\",Lots!EO232)","v":""},{"$f":"IF(Lots!A232=\"\",\"\",Lots!EP232)","v":""},{"$f":"IF(Lots!A232=\"\",\"\",Lots!EQ232)","v":""},{"$f":"IF(Lots!A232=\"\",\"\",Lots!ER232)","v":""}]
[{"$f":"IF(Lots!A233=\"\",\"\",Lots!A233)","v":""},{"$f":"IF(Lots!A233=\"\",\"\",Lots!F233)","v":""},{"$f":"IF(Lots!A233=\"\",\"\",Lots!J233)","v":""},{"$f":"IF(Lots!A233=\"\",\"\",Lots!G233)","v":""},{"$f":"IF(Lots!A233=\"\",\"\",Lots!H233)","v":""},{"$f":"IF(Lots!A233=\"\",\"\",Lots!EA233)","v":""},{"$f":"IF(Lots!A233=\"\",\"\",Lots!EB233)","v":""},{"$f":"IF(Lots!A233=\"\",\"\",Lots!EK233)","v":""},{"$f":"IF(Lots!A233=\"\",\"\",Lots!EF233)","v":""},{"$f":"IF(Lots!F233=\"\",\"\",Lots!EG233)","v":""},{"$f":"IF(Lots!H233=\"\",\"\",Lots!EH233)","v":""},"",{"$f":"IF(A244=\"\",\"\",IF(Lots!ET233=TRUE,\"D\",\"S\"))","v":""},0,0,0,{"$f":"IF(Lots!A233=\"\",\"\",Lots!EM233)","v":""},{"$f":"IF(Lots!A233=\"\",\"\",Lots!EN233)","v":""},{"$f":"IF(Lots!A233=\"\",\"\",Lots!EO233)","v":""},{"$f":"IF(Lots!A233=\"\",\"\",Lots!EP233)","v":""},{"$f":"IF(Lots!A233=\"\",\"\",Lots!EQ233)","v":""},{"$f":"IF(Lots!A233=\"\",\"\",Lots!ER233)","v":""}]
[{"$f":"IF(Lots!A234=\"\",\"\",Lots!A234)","v":""},{"$f":"IF(Lots!A234=\"\",\"\",Lots!F234)","v":""},{"$f":"IF(Lots!A234=\"\",\"\",Lots!J234)","v":""},{"$f":"IF(Lots!A234=\"\",\"\",Lots!G234)","v":""},{"$f":"IF(Lots!A234=\"\",\"\",Lots!H234)","v":""},{"$f":"IF(Lots!A234=\"\",\"\",Lots!EA234)","v":""},{"$f":"IF(Lots!A234=\"\",\"\",Lots!EB234)","v":""},{"$f":"IF(Lots!A234=\"\",\"\",Lots!EK234)","v":""},{"$f":"IF(Lots!A234=\"\",\"\",Lots!EF234)","v":""},{"$f":"IF(Lots!F234=\"\",\"\",Lots!EG234)","v":""},{"$f":"IF(Lots!H234=\"\",\"\",Lots!EH234)","v":""},"",{"$f":"IF(A245=\"\",\"\",IF(Lots!ET234=TRUE,\"D\",\"S\"))","v":""},0,0,0,{"$f":"IF(Lots!A234=\"\",\"\",Lots!EM234)","v":""},{"$f":"IF(Lots!A234=\"\",\"\",Lots!EN234)","v":""},{"$f":"IF(Lots!A234=\"\",\"\",Lots!EO234)","v":""},{"$f":"IF(Lots!A234=\"\",\"\",Lots!EP234)","v":""},{"$f":"IF(Lots!A234=\"\",\"\",Lots!EQ234)","v":""},{"$f":"IF(Lots!A234=\"\",\"\",Lots!ER234)","v":""}]
[{"$f":"IF(Lots!A235=\"\",\"\",Lots!A235)","v":""},{"$f":"IF(Lots!A235=\"\",\"\",Lots!F235)","v":""},{"$f":"IF(Lots!A235=\"\",\"\",Lots!J235)","v":""},{"$f":"IF(Lots!A235=\"\",\"\",Lots!G235)","v":""},{"$f":"IF(Lots!A235=\"\",\"\",Lots!H235)","v":""},{"$f":"IF(Lots!A235=\"\",\"\",Lots!EA235)","v":""},{"$f":"IF(Lots!A235=\"\",\"\",Lots!EB235)","v":""},{"$f":"IF(Lots!A235=\"\",\"\",Lots!EK235)","v":""},{"$f":"IF(Lots!A235=\"\",\"\",Lots!EF235)","v":""},{"$f":"IF(Lots!F235=\"\",\"\",Lots!EG235)","v":""},{"$f":"IF(Lots!H235=\"\",\"\",Lots!EH235)","v":""},"",{"$f":"IF(A246=\"\",\"\",IF(Lots!ET235=TRUE,\"D\",\"S\"))","v":""},0,0,0,{"$f":"IF(Lots!A235=\"\",\"\",Lots!EM235)","v":""},{"$f":"IF(Lots!A235=\"\",\"\",Lots!EN235)","v":""},{"$f":"IF(Lots!A235=\"\",\"\",Lots!EO235)","v":""},{"$f":"IF(Lots!A235=\"\",\"\",Lots!EP235)","v":""},{"$f":"IF(Lots!A235=\"\",\"\",Lots!EQ235)","v":""},{"$f":"IF(Lots!A235=\"\",\"\",Lots!ER235)","v":""}]
[{"$f":"IF(Lots!A236=\"\",\"\",Lots!A236)","v":""},{"$f":"IF(Lots!A236=\"\",\"\",Lots!F236)","v":""},{"$f":"IF(Lots!A236=\"\",\"\",Lots!J236)","v":""},{"$f":"IF(Lots!A236=\"\",\"\",Lots!G236)","v":""},{"$f":"IF(Lots!A236=\"\",\"\",Lots!H236)","v":""},{"$f":"IF(Lots!A236=\"\",\"\",Lots!EA236)","v":""},{"$f":"IF(Lots!A236=\"\",\"\",Lots!EB236)","v":""},{"$f":"IF(Lots!A236=\"\",\"\",Lots!EK236)","v":""},{"$f":"IF(Lots!A236=\"\",\"\",Lots!EF236)","v":""},{"$f":"IF(Lots!F236=\"\",\"\",Lots!EG236)","v":""},{"$f":"IF(Lots!H236=\"\",\"\",Lots!EH236)","v":""},"",{"$f":"IF(A247=\"\",\"\",IF(Lots!ET236=TRUE,\"D\",\"S\"))","v":""},0,0,0,{"$f":"IF(Lots!A236=\"\",\"\",Lots!EM236)","v":""},{"$f":"IF(Lots!A236=\"\",\"\",Lots!EN236)","v":""},{"$f":"IF(Lots!A236=\"\",\"\",Lots!EO236)","v":""},{"$f":"IF(Lots!A236=\"\",\"\",Lots!EP236)","v":""},{"$f":"IF(Lots!A236=\"\",\"\",Lots!EQ236)","v":""},{"$f":"IF(Lots!A236=\"\",\"\",Lots!ER236)","v":""}]
[{"$f":"IF(Lots!A237=\"\",\"\",Lots!A237)","v":""},{"$f":"IF(Lots!A237=\"\",\"\",Lots!F237)","v":""},{"$f":"IF(Lots!A237=\"\",\"\",Lots!J237)","v":""},{"$f":"IF(Lots!A237=\"\",\"\",Lots!G237)","v":""},{"$f":"IF(Lots!A237=\"\",\"\",Lots!H237)","v":""},{"$f":"IF(Lots!A237=\"\",\"\",Lots!EA237)","v":""},{"$f":"IF(Lots!A237=\"\",\"\",Lots!EB237)","v":""},{"$f":"IF(Lots!A237=\"\",\"\",Lots!EK237)","v":""},{"$f":"IF(Lots!A237=\"\",\"\",Lots!EF237)","v":""},{"$f":"IF(Lots!F237=\"\",\"\",Lots!EG237)","v":""},{"$f":"IF(Lots!H237=\"\",\"\",Lots!EH237)","v":""},"",{"$f":"IF(A248=\"\",\"\",IF(Lots!ET237=TRUE,\"D\",\"S\"))","v":""},0,0,0,{"$f":"IF(Lots!A237=\"\",\"\",Lots!EM237)","v":""},{"$f":"IF(Lots!A237=\"\",\"\",Lots!EN237)","v":""},{"$f":"IF(Lots!A237=\"\",\"\",Lots!EO237)","v":""},{"$f":"IF(Lots!A237=\"\",\"\",Lots!EP237)","v":""},{"$f":"IF(Lots!A237=\"\",\"\",Lots!EQ237)","v":""},{"$f":"IF(Lots!A237=\"\",\"\",Lots!ER237)","v":""}]
[{"$f":"IF(Lots!A238=\"\",\"\",Lots!A238)","v":""},{"$f":"IF(Lots!A238=\"\",\"\",Lots!F238)","v":""},{"$f":"IF(Lots!A238=\"\",\"\",Lots!J238)","v":""},{"$f":"IF(Lots!A238=\"\",\"\",Lots!G238)","v":""},{"$f":"IF(Lots!A238=\"\",\"\",Lots!H238)","v":""},{"$f":"IF(Lots!A238=\"\",\"\",Lots!EA238)","v":""},{"$f":"IF(Lots!A238=\"\",\"\",Lots!EB238)","v":""},{"$f":"IF(Lots!A238=\"\",\"\",Lots!EK238)","v":""},{"$f":"IF(Lots!A238=\"\",\"\",Lots!EF238)","v":""},{"$f":"IF(Lots!F238=\"\",\"\",Lots!EG238)","v":""},{"$f":"IF(Lots!H238=\"\",\"\",Lots!EH238)","v":""},"",{"$f":"IF(A249=\"\",\"\",IF(Lots!ET238=TRUE,\"D\",\"S\"))","v":""},0,0,0,{"$f":"IF(Lots!A238=\"\",\"\",Lots!EM238)","v":""},{"$f":"IF(Lots!A238=\"\",\"\",Lots!EN238)","v":""},{"$f":"IF(Lots!A238=\"\",\"\",Lots!EO238)","v":""},{"$f":"IF(Lots!A238=\"\",\"\",Lots!EP238)","v":""},{"$f":"IF(Lots!A238=\"\",\"\",Lots!EQ238)","v":""},{"$f":"IF(Lots!A238=\"\",\"\",Lots!ER238)","v":""}]
[{"$f":"IF(Lots!A239=\"\",\"\",Lots!A239)","v":""},{"$f":"IF(Lots!A239=\"\",\"\",Lots!F239)","v":""},{"$f":"IF(Lots!A239=\"\",\"\",Lots!J239)","v":""},{"$f":"IF(Lots!A239=\"\",\"\",Lots!G239)","v":""},{"$f":"IF(Lots!A239=\"\",\"\",Lots!H239)","v":""},{"$f":"IF(Lots!A239=\"\",\"\",Lots!EA239)","v":""},{"$f":"IF(Lots!A239=\"\",\"\",Lots!EB239)","v":""},{"$f":"IF(Lots!A239=\"\",\"\",Lots!EK239)","v":""},{"$f":"IF(Lots!A239=\"\",\"\",Lots!EF239)","v":""},{"$f":"IF(Lots!F239=\"\",\"\",Lots!EG239)","v":""},{"$f":"IF(Lots!H239=\"\",\"\",Lots!EH239)","v":""},"",{"$f":"IF(A250=\"\",\"\",IF(Lots!ET239=TRUE,\"D\",\"S\"))","v":""},0,0,0,{"$f":"IF(Lots!A239=\"\",\"\",Lots!EM239)","v":""},{"$f":"IF(Lots!A239=\"\",\"\",Lots!EN239)","v":""},{"$f":"IF(Lots!A239=\"\",\"\",Lots!EO239)","v":""},{"$f":"IF(Lots!A239=\"\",\"\",Lots!EP239)","v":""},{"$f":"IF(Lots!A239=\"\",\"\",Lots!EQ239)","v":""},{"$f":"IF(Lots!A239=\"\",\"\",Lots!ER239)","v":""}]
[{"$f":"IF(Lots!A240=\"\",\"\",Lots!A240)","v":""},{"$f":"IF(Lots!A240=\"\",\"\",Lots!F240)","v":""},{"$f":"IF(Lots!A240=\"\",\"\",Lots!J240)","v":""},{"$f":"IF(Lots!A240=\"\",\"\",Lots!G240)","v":""},{"$f":"IF(Lots!A240=\"\",\"\",Lots!H240)","v":""},{"$f":"IF(Lots!A240=\"\",\"\",Lots!EA240)","v":""},{"$f":"IF(Lots!A240=\"\",\"\",Lots!EB240)","v":""},{"$f":"IF(Lots!A240=\"\",\"\",Lots!EK240)","v":""},{"$f":"IF(Lots!A240=\"\",\"\",Lots!EF240)","v":""},{"$f":"IF(Lots!F240=\"\",\"\",Lots!EG240)","v":""},{"$f":"IF(Lots!H240=\"\",\"\",Lots!EH240)","v":""},"",{"$f":"IF(A251=\"\",\"\",IF(Lots!ET240=TRUE,\"D\",\"S\"))","v":""},0,0,0,{"$f":"IF(Lots!A240=\"\",\"\",Lots!EM240)","v":""},{"$f":"IF(Lots!A240=\"\",\"\",Lots!EN240)","v":""},{"$f":"IF(Lots!A240=\"\",\"\",Lots!EO240)","v":""},{"$f":"IF(Lots!A240=\"\",\"\",Lots!EP240)","v":""},{"$f":"IF(Lots!A240=\"\",\"\",Lots!EQ240)","v":""},{"$f":"IF(Lots!A240=\"\",\"\",Lots!ER240)","v":""}]
[{"$f":"IF(Lots!A241=\"\",\"\",Lots!A241)","v":""},{"$f":"IF(Lots!A241=\"\",\"\",Lots!F241)","v":""},{"$f":"IF(Lots!A241=\"\",\"\",Lots!J241)","v":""},{"$f":"IF(Lots!A241=\"\",\"\",Lots!G241)","v":""},{"$f":"IF(Lots!A241=\"\",\"\",Lots!H241)","v":""},{"$f":"IF(Lots!A241=\"\",\"\",Lots!EA241)","v":""},{"$f":"IF(Lots!A241=\"\",\"\",Lots!EB241)","v":""},{"$f":"IF(Lots!A241=\"\",\"\",Lots!EK241)","v":""},{"$f":"IF(Lots!A241=\"\",\"\",Lots!EF241)","v":""},{"$f":"IF(Lots!F241=\"\",\"\",Lots!EG241)","v":""},{"$f":"IF(Lots!H241=\"\",\"\",Lots!EH241)","v":""},"",{"$f":"IF(A252=\"\",\"\",IF(Lots!ET241=TRUE,\"D\",\"S\"))","v":""},0,0,0,{"$f":"IF(Lots!A241=\"\",\"\",Lots!EM241)","v":""},{"$f":"IF(Lots!A241=\"\",\"\",Lots!EN241)","v":""},{"$f":"IF(Lots!A241=\"\",\"\",Lots!EO241)","v":""},{"$f":"IF(Lots!A241=\"\",\"\",Lots!EP241)","v":""},{"$f":"IF(Lots!A241=\"\",\"\",Lots!EQ241)","v":""},{"$f":"IF(Lots!A241=\"\",\"\",Lots!ER241)","v":""}]
[{"$f":"IF(Lots!A242=\"\",\"\",Lots!A242)","v":""},{"$f":"IF(Lots!A242=\"\",\"\",Lots!F242)","v":""},{"$f":"IF(Lots!A242=\"\",\"\",Lots!J242)","v":""},{"$f":"IF(Lots!A242=\"\",\"\",Lots!G242)","v":""},{"$f":"IF(Lots!A242=\"\",\"\",Lots!H242)","v":""},{"$f":"IF(Lots!A242=\"\",\"\",Lots!EA242)","v":""},{"$f":"IF(Lots!A242=\"\",\"\",Lots!EB242)","v":""},{"$f":"IF(Lots!A242=\"\",\"\",Lots!EK242)","v":""},{"$f":"IF(Lots!A242=\"\",\"\",Lots!EF242)","v":""},{"$f":"IF(Lots!F242=\"\",\"\",Lots!EG242)","v":""},{"$f":"IF(Lots!H242=\"\",\"\",Lots!EH242)","v":""},"",{"$f":"IF(A253=\"\",\"\",IF(Lots!ET242=TRUE,\"D\",\"S\"))","v":""},0,0,0,{"$f":"IF(Lots!A242=\"\",\"\",Lots!EM242)","v":""},{"$f":"IF(Lots!A242=\"\",\"\",Lots!EN242)","v":""},{"$f":"IF(Lots!A242=\"\",\"\",Lots!EO242)","v":""},{"$f":"IF(Lots!A242=\"\",\"\",Lots!EP242)","v":""},{"$f":"IF(Lots!A242=\"\",\"\",Lots!EQ242)","v":""},{"$f":"IF(Lots!A242=\"\",\"\",Lots!ER242)","v":""}]
[{"$f":"IF(Lots!A243=\"\",\"\",Lots!A243)","v":""},{"$f":"IF(Lots!A243=\"\",\"\",Lots!F243)","v":""},{"$f":"IF(Lots!A243=\"\",\"\",Lots!J243)","v":""},{"$f":"IF(Lots!A243=\"\",\"\",Lots!G243)","v":""},{"$f":"IF(Lots!A243=\"\",\"\",Lots!H243)","v":""},{"$f":"IF(Lots!A243=\"\",\"\",Lots!EA243)","v":""},{"$f":"IF(Lots!A243=\"\",\"\",Lots!EB243)","v":""},{"$f":"IF(Lots!A243=\"\",\"\",Lots!EK243)","v":""},{"$f":"IF(Lots!A243=\"\",\"\",Lots!EF243)","v":""},{"$f":"IF(Lots!F243=\"\",\"\",Lots!EG243)","v":""},{"$f":"IF(Lots!H243=\"\",\"\",Lots!EH243)","v":""},"",{"$f":"IF(A254=\"\",\"\",IF(Lots!ET243=TRUE,\"D\",\"S\"))","v":""},0,0,0,{"$f":"IF(Lots!A243=\"\",\"\",Lots!EM243)","v":""},{"$f":"IF(Lots!A243=\"\",\"\",Lots!EN243)","v":""},{"$f":"IF(Lots!A243=\"\",\"\",Lots!EO243)","v":""},{"$f":"IF(Lots!A243=\"\",\"\",Lots!EP243)","v":""},{"$f":"IF(Lots!A243=\"\",\"\",Lots!EQ243)","v":""},{"$f":"IF(Lots!A243=\"\",\"\",Lots!ER243)","v":""}]
[{"$f":"IF(Lots!A244=\"\",\"\",Lots!A244)","v":""},{"$f":"IF(Lots!A244=\"\",\"\",Lots!F244)","v":""},{"$f":"IF(Lots!A244=\"\",\"\",Lots!J244)","v":""},{"$f":"IF(Lots!A244=\"\",\"\",Lots!G244)","v":""},{"$f":"IF(Lots!A244=\"\",\"\",Lots!H244)","v":""},{"$f":"IF(Lots!A244=\"\",\"\",Lots!EA244)","v":""},{"$f":"IF(Lots!A244=\"\",\"\",Lots!EB244)","v":""},{"$f":"IF(Lots!A244=\"\",\"\",Lots!EK244)","v":""},{"$f":"IF(Lots!A244=\"\",\"\",Lots!EF244)","v":""},{"$f":"IF(Lots!F244=\"\",\"\",Lots!EG244)","v":""},{"$f":"IF(Lots!H244=\"\",\"\",Lots!EH244)","v":""},"",{"$f":"IF(A255=\"\",\"\",IF(Lots!ET244=TRUE,\"D\",\"S\"))","v":""},0,0,0,{"$f":"IF(Lots!A244=\"\",\"\",Lots!EM244)","v":""},{"$f":"IF(Lots!A244=\"\",\"\",Lots!EN244)","v":""},{"$f":"IF(Lots!A244=\"\",\"\",Lots!EO244)","v":""},{"$f":"IF(Lots!A244=\"\",\"\",Lots!EP244)","v":""},{"$f":"IF(Lots!A244=\"\",\"\",Lots!EQ244)","v":""},{"$f":"IF(Lots!A244=\"\",\"\",Lots!ER244)","v":""}]
[{"$f":"IF(Lots!A245=\"\",\"\",Lots!A245)","v":""},{"$f":"IF(Lots!A245=\"\",\"\",Lots!F245)","v":""},{"$f":"IF(Lots!A245=\"\",\"\",Lots!J245)","v":""},{"$f":"IF(Lots!A245=\"\",\"\",Lots!G245)","v":""},{"$f":"IF(Lots!A245=\"\",\"\",Lots!H245)","v":""},{"$f":"IF(Lots!A245=\"\",\"\",Lots!EA245)","v":""},{"$f":"IF(Lots!A245=\"\",\"\",Lots!EB245)","v":""},{"$f":"IF(Lots!A245=\"\",\"\",Lots!EK245)","v":""},{"$f":"IF(Lots!A245=\"\",\"\",Lots!EF245)","v":""},{"$f":"IF(Lots!F245=\"\",\"\",Lots!EG245)","v":""},{"$f":"IF(Lots!H245=\"\",\"\",Lots!EH245)","v":""},"",{"$f":"IF(A256=\"\",\"\",IF(Lots!ET245=TRUE,\"D\",\"S\"))","v":""},0,0,0,{"$f":"IF(Lots!A245=\"\",\"\",Lots!EM245)","v":""},{"$f":"IF(Lots!A245=\"\",\"\",Lots!EN245)","v":""},{"$f":"IF(Lots!A245=\"\",\"\",Lots!EO245)","v":""},{"$f":"IF(Lots!A245=\"\",\"\",Lots!EP245)","v":""},{"$f":"IF(Lots!A245=\"\",\"\",Lots!EQ245)","v":""},{"$f":"IF(Lots!A245=\"\",\"\",Lots!ER245)","v":""}]
[{"$f":"IF(Lots!A246=\"\",\"\",Lots!A246)","v":""},{"$f":"IF(Lots!A246=\"\",\"\",Lots!F246)","v":""},{"$f":"IF(Lots!A246=\"\",\"\",Lots!J246)","v":""},{"$f":"IF(Lots!A246=\"\",\"\",Lots!G246)","v":""},{"$f":"IF(Lots!A246=\"\",\"\",Lots!H246)","v":""},{"$f":"IF(Lots!A246=\"\",\"\",Lots!EA246)","v":""},{"$f":"IF(Lots!A246=\"\",\"\",Lots!EB246)","v":""},{"$f":"IF(Lots!A246=\"\",\"\",Lots!EK246)","v":""},{"$f":"IF(Lots!A246=\"\",\"\",Lots!EF246)","v":""},{"$f":"IF(Lots!F246=\"\",\"\",Lots!EG246)","v":""},{"$f":"IF(Lots!H246=\"\",\"\",Lots!EH246)","v":""},"",{"$f":"IF(A257=\"\",\"\",IF(Lots!ET246=TRUE,\"D\",\"S\"))","v":""},0,0,0,{"$f":"IF(Lots!A246=\"\",\"\",Lots!EM246)","v":""},{"$f":"IF(Lots!A246=\"\",\"\",Lots!EN246)","v":""},{"$f":"IF(Lots!A246=\"\",\"\",Lots!EO246)","v":""},{"$f":"IF(Lots!A246=\"\",\"\",Lots!EP246)","v":""},{"$f":"IF(Lots!A246=\"\",\"\",Lots!EQ246)","v":""},{"$f":"IF(Lots!A246=\"\",\"\",Lots!ER246)","v":""}]
[{"$f":"IF(Lots!A247=\"\",\"\",Lots!A247)","v":""},{"$f":"IF(Lots!A247=\"\",\"\",Lots!F247)","v":""},{"$f":"IF(Lots!A247=\"\",\"\",Lots!J247)","v":""},{"$f":"IF(Lots!A247=\"\",\"\",Lots!G247)","v":""},{"$f":"IF(Lots!A247=\"\",\"\",Lots!H247)","v":""},{"$f":"IF(Lots!A247=\"\",\"\",Lots!EA247)","v":""},{"$f":"IF(Lots!A247=\"\",\"\",Lots!EB247)","v":""},{"$f":"IF(Lots!A247=\"\",\"\",Lots!EK247)","v":""},{"$f":"IF(Lots!A247=\"\",\"\",Lots!EF247)","v":""},{"$f":"IF(Lots!F247=\"\",\"\",Lots!EG247)","v":""},{"$f":"IF(Lots!H247=\"\",\"\",Lots!EH247)","v":""},"",{"$f":"IF(A258=\"\",\"\",IF(Lots!ET247=TRUE,\"D\",\"S\"))","v":""},0,0,0,{"$f":"IF(Lots!A247=\"\",\"\",Lots!EM247)","v":""},{"$f":"IF(Lots!A247=\"\",\"\",Lots!EN247)","v":""},{"$f":"IF(Lots!A247=\"\",\"\",Lots!EO247)","v":""},{"$f":"IF(Lots!A247=\"\",\"\",Lots!EP247)","v":""},{"$f":"IF(Lots!A247=\"\",\"\",Lots!EQ247)","v":""},{"$f":"IF(Lots!A247=\"\",\"\",Lots!ER247)","v":""}]
[{"$f":"IF(Lots!A248=\"\",\"\",Lots!A248)","v":""},{"$f":"IF(Lots!A248=\"\",\"\",Lots!F248)","v":""},{"$f":"IF(Lots!A248=\"\",\"\",Lots!J248)","v":""},{"$f":"IF(Lots!A248=\"\",\"\",Lots!G248)","v":""},{"$f":"IF(Lots!A248=\"\",\"\",Lots!H248)","v":""},{"$f":"IF(Lots!A248=\"\",\"\",Lots!EA248)","v":""},{"$f":"IF(Lots!A248=\"\",\"\",Lots!EB248)","v":""},{"$f":"IF(Lots!A248=\"\",\"\",Lots!EK248)","v":""},{"$f":"IF(Lots!A248=\"\",\"\",Lots!EF248)","v":""},{"$f":"IF(Lots!F248=\"\",\"\",Lots!EG248)","v":""},{"$f":"IF(Lots!H248=\"\",\"\",Lots!EH248)","v":""},"",{"$f":"IF(A259=\"\",\"\",IF(Lots!ET248=TRUE,\"D\",\"S\"))","v":""},0,0,0,{"$f":"IF(Lots!A248=\"\",\"\",Lots!EM248)","v":""},{"$f":"IF(Lots!A248=\"\",\"\",Lots!EN248)","v":""},{"$f":"IF(Lots!A248=\"\",\"\",Lots!EO248)","v":""},{"$f":"IF(Lots!A248=\"\",\"\",Lots!EP248)","v":""},{"$f":"IF(Lots!A248=\"\",\"\",Lots!EQ248)","v":""},{"$f":"IF(Lots!A248=\"\",\"\",Lots!ER248)","v":""}]
[{"$f":"IF(Lots!A249=\"\",\"\",Lots!A249)","v":""},{"$f":"IF(Lots!A249=\"\",\"\",Lots!F249)","v":""},{"$f":"IF(Lots!A249=\"\",\"\",Lots!J249)","v":""},{"$f":"IF(Lots!A249=\"\",\"\",Lots!G249)","v":""},{"$f":"IF(Lots!A249=\"\",\"\",Lots!H249)","v":""},{"$f":"IF(Lots!A249=\"\",\"\",Lots!EA249)","v":""},{"$f":"IF(Lots!A249=\"\",\"\",Lots!EB249)","v":""},{"$f":"IF(Lots!A249=\"\",\"\",Lots!EK249)","v":""},{"$f":"IF(Lots!A249=\"\",\"\",Lots!EF249)","v":""},{"$f":"IF(Lots!F249=\"\",\"\",Lots!EG249)","v":""},{"$f":"IF(Lots!H249=\"\",\"\",Lots!EH249)","v":""},"",{"$f":"IF(A260=\"\",\"\",IF(Lots!ET249=TRUE,\"D\",\"S\"))","v":""},0,0,0,{"$f":"IF(Lots!A249=\"\",\"\",Lots!EM249)","v":""},{"$f":"IF(Lots!A249=\"\",\"\",Lots!EN249)","v":""},{"$f":"IF(Lots!A249=\"\",\"\",Lots!EO249)","v":""},{"$f":"IF(Lots!A249=\"\",\"\",Lots!EP249)","v":""},{"$f":"IF(Lots!A249=\"\",\"\",Lots!EQ249)","v":""},{"$f":"IF(Lots!A249=\"\",\"\",Lots!ER249)","v":""}]
[{"$f":"IF(Lots!A250=\"\",\"\",Lots!A250)","v":""},{"$f":"IF(Lots!A250=\"\",\"\",Lots!F250)","v":""},{"$f":"IF(Lots!A250=\"\",\"\",Lots!J250)","v":""},{"$f":"IF(Lots!A250=\"\",\"\",Lots!G250)","v":""},{"$f":"IF(Lots!A250=\"\",\"\",Lots!H250)","v":""},{"$f":"IF(Lots!A250=\"\",\"\",Lots!EA250)","v":""},{"$f":"IF(Lots!A250=\"\",\"\",Lots!EB250)","v":""},{"$f":"IF(Lots!A250=\"\",\"\",Lots!EK250)","v":""},{"$f":"IF(Lots!A250=\"\",\"\",Lots!EF250)","v":""},{"$f":"IF(Lots!F250=\"\",\"\",Lots!EG250)","v":""},{"$f":"IF(Lots!H250=\"\",\"\",Lots!EH250)","v":""},"",{"$f":"IF(A261=\"\",\"\",IF(Lots!ET250=TRUE,\"D\",\"S\"))","v":""},0,0,0,{"$f":"IF(Lots!A250=\"\",\"\",Lots!EM250)","v":""},{"$f":"IF(Lots!A250=\"\",\"\",Lots!EN250)","v":""},{"$f":"IF(Lots!A250=\"\",\"\",Lots!EO250)","v":""},{"$f":"IF(Lots!A250=\"\",\"\",Lots!EP250)","v":""},{"$f":"IF(Lots!A250=\"\",\"\",Lots!EQ250)","v":""},{"$f":"IF(Lots!A250=\"\",\"\",Lots!ER250)","v":""}]
[{"$f":"IF(Lots!A251=\"\",\"\",Lots!A251)","v":""},{"$f":"IF(Lots!A251=\"\",\"\",Lots!F251)","v":""},{"$f":"IF(Lots!A251=\"\",\"\",Lots!J251)","v":""},{"$f":"IF(Lots!A251=\"\",\"\",Lots!G251)","v":""},{"$f":"IF(Lots!A251=\"\",\"\",Lots!H251)","v":""},{"$f":"IF(Lots!A251=\"\",\"\",Lots!EA251)","v":""},{"$f":"IF(Lots!A251=\"\",\"\",Lots!EB251)","v":""},{"$f":"IF(Lots!A251=\"\",\"\",Lots!EK251)","v":""},{"$f":"IF(Lots!A251=\"\",\"\",Lots!EF251)","v":""},{"$f":"IF(Lots!F251=\"\",\"\",Lots!EG251)","v":""},{"$f":"IF(Lots!H251=\"\",\"\",Lots!EH251)","v":""},"",{"$f":"IF(A262=\"\",\"\",IF(Lots!ET251=TRUE,\"D\",\"S\"))","v":""},0,0,0,{"$f":"IF(Lots!A251=\"\",\"\",Lots!EM251)","v":""},{"$f":"IF(Lots!A251=\"\",\"\",Lots!EN251)","v":""},{"$f":"IF(Lots!A251=\"\",\"\",Lots!EO251)","v":""},{"$f":"IF(Lots!A251=\"\",\"\",Lots!EP251)","v":""},{"$f":"IF(Lots!A251=\"\",\"\",Lots!EQ251)","v":""},{"$f":"IF(Lots!A251=\"\",\"\",Lots!ER251)","v":""}]
[{"$f":"IF(Lots!A252=\"\",\"\",Lots!A252)","v":""},{"$f":"IF(Lots!A252=\"\",\"\",Lots!F252)","v":""},{"$f":"IF(Lots!A252=\"\",\"\",Lots!J252)","v":""},{"$f":"IF(Lots!A252=\"\",\"\",Lots!G252)","v":""},{"$f":"IF(Lots!A252=\"\",\"\",Lots!H252)","v":""},{"$f":"IF(Lots!A252=\"\",\"\",Lots!EA252)","v":""},{"$f":"IF(Lots!A252=\"\",\"\",Lots!EB252)","v":""},{"$f":"IF(Lots!A252=\"\",\"\",Lots!EK252)","v":""},{"$f":"IF(Lots!A252=\"\",\"\",Lots!EF252)","v":""},{"$f":"IF(Lots!F252=\"\",\"\",Lots!EG252)","v":""},{"$f":"IF(Lots!H252=\"\",\"\",Lots!EH252)","v":""},"",{"$f":"IF(A263=\"\",\"\",IF(Lots!ET252=TRUE,\"D\",\"S\"))","v":""},0,0,0,{"$f":"IF(Lots!A252=\"\",\"\",Lots!EM252)","v":""},{"$f":"IF(Lots!A252=\"\",\"\",Lots!EN252)","v":""},{"$f":"IF(Lots!A252=\"\",\"\",Lots!EO252)","v":""},{"$f":"IF(Lots!A252=\"\",\"\",Lots!EP252)","v":""},{"$f":"IF(Lots!A252=\"\",\"\",Lots!EQ252)","v":""},{"$f":"IF(Lots!A252=\"\",\"\",Lots!ER252)","v":""}]
[{"$f":"IF(Lots!A253=\"\",\"\",Lots!A253)","v":""},{"$f":"IF(Lots!A253=\"\",\"\",Lots!F253)","v":""},{"$f":"IF(Lots!A253=\"\",\"\",Lots!J253)","v":""},{"$f":"IF(Lots!A253=\"\",\"\",Lots!G253)","v":""},{"$f":"IF(Lots!A253=\"\",\"\",Lots!H253)","v":""},{"$f":"IF(Lots!A253=\"\",\"\",Lots!EA253)","v":""},{"$f":"IF(Lots!A253=\"\",\"\",Lots!EB253)","v":""},{"$f":"IF(Lots!A253=\"\",\"\",Lots!EK253)","v":""},{"$f":"IF(Lots!A253=\"\",\"\",Lots!EF253)","v":""},{"$f":"IF(Lots!F253=\"\",\"\",Lots!EG253)","v":""},{"$f":"IF(Lots!H253=\"\",\"\",Lots!EH253)","v":""},"",{"$f":"IF(A264=\"\",\"\",IF(Lots!ET253=TRUE,\"D\",\"S\"))","v":""},0,0,0,{"$f":"IF(Lots!A253=\"\",\"\",Lots!EM253)","v":""},{"$f":"IF(Lots!A253=\"\",\"\",Lots!EN253)","v":""},{"$f":"IF(Lots!A253=\"\",\"\",Lots!EO253)","v":""},{"$f":"IF(Lots!A253=\"\",\"\",Lots!EP253)","v":""},{"$f":"IF(Lots!A253=\"\",\"\",Lots!EQ253)","v":""},{"$f":"IF(Lots!A253=\"\",\"\",Lots!ER253)","v":""}]
[{"$f":"IF(Lots!A254=\"\",\"\",Lots!A254)","v":""},{"$f":"IF(Lots!A254=\"\",\"\",Lots!F254)","v":""},{"$f":"IF(Lots!A254=\"\",\"\",Lots!J254)","v":""},{"$f":"IF(Lots!A254=\"\",\"\",Lots!G254)","v":""},{"$f":"IF(Lots!A254=\"\",\"\",Lots!H254)","v":""},{"$f":"IF(Lots!A254=\"\",\"\",Lots!EA254)","v":""},{"$f":"IF(Lots!A254=\"\",\"\",Lots!EB254)","v":""},{"$f":"IF(Lots!A254=\"\",\"\",Lots!EK254)","v":""},{"$f":"IF(Lots!A254=\"\",\"\",Lots!EF254)","v":""},{"$f":"IF(Lots!F254=\"\",\"\",Lots!EG254)","v":""},{"$f":"IF(Lots!H254=\"\",\"\",Lots!EH254)","v":""},"",{"$f":"IF(A265=\"\",\"\",IF(Lots!ET254=TRUE,\"D\",\"S\"))","v":""},0,0,0,{"$f":"IF(Lots!A254=\"\",\"\",Lots!EM254)","v":""},{"$f":"IF(Lots!A254=\"\",\"\",Lots!EN254)","v":""},{"$f":"IF(Lots!A254=\"\",\"\",Lots!EO254)","v":""},{"$f":"IF(Lots!A254=\"\",\"\",Lots!EP254)","v":""},{"$f":"IF(Lots!A254=\"\",\"\",Lots!EQ254)","v":""},{"$f":"IF(Lots!A254=\"\",\"\",Lots!ER254)","v":""}]
[{"$f":"IF(Lots!A255=\"\",\"\",Lots!A255)","v":""},{"$f":"IF(Lots!A255=\"\",\"\",Lots!F255)","v":""},{"$f":"IF(Lots!A255=\"\",\"\",Lots!J255)","v":""},{"$f":"IF(Lots!A255=\"\",\"\",Lots!G255)","v":""},{"$f":"IF(Lots!A255=\"\",\"\",Lots!H255)","v":""},{"$f":"IF(Lots!A255=\"\",\"\",Lots!EA255)","v":""},{"$f":"IF(Lots!A255=\"\",\"\",Lots!EB255)","v":""},{"$f":"IF(Lots!A255=\"\",\"\",Lots!EK255)","v":""},{"$f":"IF(Lots!A255=\"\",\"\",Lots!EF255)","v":""},{"$f":"IF(Lots!F255=\"\",\"\",Lots!EG255)","v":""},{"$f":"IF(Lots!H255=\"\",\"\",Lots!EH255)","v":""},"",{"$f":"IF(A266=\"\",\"\",IF(Lots!ET255=TRUE,\"D\",\"S\"))","v":""},0,0,0,{"$f":"IF(Lots!A255=\"\",\"\",Lots!EM255)","v":""},{"$f":"IF(Lots!A255=\"\",\"\",Lots!EN255)","v":""},{"$f":"IF(Lots!A255=\"\",\"\",Lots!EO255)","v":""},{"$f":"IF(Lots!A255=\"\",\"\",Lots!EP255)","v":""},{"$f":"IF(Lots!A255=\"\",\"\",Lots!EQ255)","v":""},{"$f":"IF(Lots!A255=\"\",\"\",Lots!ER255)","v":""}]
[{"$f":"IF(Lots!A256=\"\",\"\",Lots!A256)","v":""},{"$f":"IF(Lots!A256=\"\",\"\",Lots!F256)","v":""},{"$f":"IF(Lots!A256=\"\",\"\",Lots!J256)","v":""},{"$f":"IF(Lots!A256=\"\",\"\",Lots!G256)","v":""},{"$f":"IF(Lots!A256=\"\",\"\",Lots!H256)","v":""},{"$f":"IF(Lots!A256=\"\",\"\",Lots!EA256)","v":""},{"$f":"IF(Lots!A256=\"\",\"\",Lots!EB256)","v":""},{"$f":"IF(Lots!A256=\"\",\"\",Lots!EK256)","v":""},{"$f":"IF(Lots!A256=\"\",\"\",Lots!EF256)","v":""},{"$f":"IF(Lots!F256=\"\",\"\",Lots!EG256)","v":""},{"$f":"IF(Lots!H256=\"\",\"\",Lots!EH256)","v":""},"",{"$f":"IF(A267=\"\",\"\",IF(Lots!ET256=TRUE,\"D\",\"S\"))","v":""},0,0,0,{"$f":"IF(Lots!A256=\"\",\"\",Lots!EM256)","v":""},{"$f":"IF(Lots!A256=\"\",\"\",Lots!EN256)","v":""},{"$f":"IF(Lots!A256=\"\",\"\",Lots!EO256)","v":""},{"$f":"IF(Lots!A256=\"\",\"\",Lots!EP256)","v":""},{"$f":"IF(Lots!A256=\"\",\"\",Lots!EQ256)","v":""},{"$f":"IF(Lots!A256=\"\",\"\",Lots!ER256)","v":""}]
[{"$f":"IF(Lots!A257=\"\",\"\",Lots!A257)","v":""},{"$f":"IF(Lots!A257=\"\",\"\",Lots!F257)","v":""},{"$f":"IF(Lots!A257=\"\",\"\",Lots!J257)","v":""},{"$f":"IF(Lots!A257=\"\",\"\",Lots!G257)","v":""},{"$f":"IF(Lots!A257=\"\",\"\",Lots!H257)","v":""},{"$f":"IF(Lots!A257=\"\",\"\",Lots!EA257)","v":""},{"$f":"IF(Lots!A257=\"\",\"\",Lots!EB257)","v":""},{"$f":"IF(Lots!A257=\"\",\"\",Lots!EK257)","v":""},{"$f":"IF(Lots!A257=\"\",\"\",Lots!EF257)","v":""},{"$f":"IF(Lots!F257=\"\",\"\",Lots!EG257)","v":""},{"$f":"IF(Lots!H257=\"\",\"\",Lots!EH257)","v":""},"",{"$f":"IF(A268=\"\",\"\",IF(Lots!ET257=TRUE,\"D\",\"S\"))","v":""},0,0,0,{"$f":"IF(Lots!A257=\"\",\"\",Lots!EM257)","v":""},{"$f":"IF(Lots!A257=\"\",\"\",Lots!EN257)","v":""},{"$f":"IF(Lots!A257=\"\",\"\",Lots!EO257)","v":""},{"$f":"IF(Lots!A257=\"\",\"\",Lots!EP257)","v":""},{"$f":"IF(Lots!A257=\"\",\"\",Lots!EQ257)","v":""},{"$f":"IF(Lots!A257=\"\",\"\",Lots!ER257)","v":""}]
[{"$f":"IF(Lots!A258=\"\",\"\",Lots!A258)","v":""},{"$f":"IF(Lots!A258=\"\",\"\",Lots!F258)","v":""},{"$f":"IF(Lots!A258=\"\",\"\",Lots!J258)","v":""},{"$f":"IF(Lots!A258=\"\",\"\",Lots!G258)","v":""},{"$f":"IF(Lots!A258=\"\",\"\",Lots!H258)","v":""},{"$f":"IF(Lots!A258=\"\",\"\",Lots!EA258)","v":""},{"$f":"IF(Lots!A258=\"\",\"\",Lots!EB258)","v":""},{"$f":"IF(Lots!A258=\"\",\"\",Lots!EK258)","v":""},{"$f":"IF(Lots!A258=\"\",\"\",Lots!EF258)","v":""},{"$f":"IF(Lots!F258=\"\",\"\",Lots!EG258)","v":""},{"$f":"IF(Lots!H258=\"\",\"\",Lots!EH258)","v":""},"",{"$f":"IF(A269=\"\",\"\",IF(Lots!ET258=TRUE,\"D\",\"S\"))","v":""},0,0,0,{"$f":"IF(Lots!A258=\"\",\"\",Lots!EM258)","v":""},{"$f":"IF(Lots!A258=\"\",\"\",Lots!EN258)","v":""},{"$f":"IF(Lots!A258=\"\",\"\",Lots!EO258)","v":""},{"$f":"IF(Lots!A258=\"\",\"\",Lots!EP258)","v":""},{"$f":"IF(Lots!A258=\"\",\"\",Lots!EQ258)","v":""},{"$f":"IF(Lots!A258=\"\",\"\",Lots!ER258)","v":""}]
[{"$f":"IF(Lots!A259=\"\",\"\",Lots!A259)","v":""},{"$f":"IF(Lots!A259=\"\",\"\",Lots!F259)","v":""},{"$f":"IF(Lots!A259=\"\",\"\",Lots!J259)","v":""},{"$f":"IF(Lots!A259=\"\",\"\",Lots!G259)","v":""},{"$f":"IF(Lots!A259=\"\",\"\",Lots!H259)","v":""},{"$f":"IF(Lots!A259=\"\",\"\",Lots!EA259)","v":""},{"$f":"IF(Lots!A259=\"\",\"\",Lots!EB259)","v":""},{"$f":"IF(Lots!A259=\"\",\"\",Lots!EK259)","v":""},{"$f":"IF(Lots!A259=\"\",\"\",Lots!EF259)","v":""},{"$f":"IF(Lots!F259=\"\",\"\",Lots!EG259)","v":""},{"$f":"IF(Lots!H259=\"\",\"\",Lots!EH259)","v":""},"",{"$f":"IF(A270=\"\",\"\",IF(Lots!ET259=TRUE,\"D\",\"S\"))","v":""},0,0,0,{"$f":"IF(Lots!A259=\"\",\"\",Lots!EM259)","v":""},{"$f":"IF(Lots!A259=\"\",\"\",Lots!EN259)","v":""},{"$f":"IF(Lots!A259=\"\",\"\",Lots!EO259)","v":""},{"$f":"IF(Lots!A259=\"\",\"\",Lots!EP259)","v":""},{"$f":"IF(Lots!A259=\"\",\"\",Lots!EQ259)","v":""},{"$f":"IF(Lots!A259=\"\",\"\",Lots!ER259)","v":""}]
[{"$f":"IF(Lots!A260=\"\",\"\",Lots!A260)","v":""},{"$f":"IF(Lots!A260=\"\",\"\",Lots!F260)","v":""},{"$f":"IF(Lots!A260=\"\",\"\",Lots!J260)","v":""},{"$f":"IF(Lots!A260=\"\",\"\",Lots!G260)","v":""},{"$f":"IF(Lots!A260=\"\",\"\",Lots!H260)","v":""},{"$f":"IF(Lots!A260=\"\",\"\",Lots!EA260)","v":""},{"$f":"IF(Lots!A260=\"\",\"\",Lots!EB260)","v":""},{"$f":"IF(Lots!A260=\"\",\"\",Lots!EK260)","v":""},{"$f":"IF(Lots!A260=\"\",\"\",Lots!EF260)","v":""},{"$f":"IF(Lots!F260=\"\",\"\",Lots!EG260)","v":""},{"$f":"IF(Lots!H260=\"\",\"\",Lots!EH260)","v":""},"",{"$f":"IF(A271=\"\",\"\",IF(Lots!ET260=TRUE,\"D\",\"S\"))","v":""},0,0,0,{"$f":"IF(Lots!A260=\"\",\"\",Lots!EM260)","v":""},{"$f":"IF(Lots!A260=\"\",\"\",Lots!EN260)","v":""},{"$f":"IF(Lots!A260=\"\",\"\",Lots!EO260)","v":""},{"$f":"IF(Lots!A260=\"\",\"\",Lots!EP260)","v":""},{"$f":"IF(Lots!A260=\"\",\"\",Lots!EQ260)","v":""},{"$f":"IF(Lots!A260=\"\",\"\",Lots!ER260)","v":""}]
[{"$f":"IF(Lots!A261=\"\",\"\",Lots!A261)","v":""},{"$f":"IF(Lots!A261=\"\",\"\",Lots!F261)","v":""},{"$f":"IF(Lots!A261=\"\",\"\",Lots!J261)","v":""},{"$f":"IF(Lots!A261=\"\",\"\",Lots!G261)","v":""},{"$f":"IF(Lots!A261=\"\",\"\",Lots!H261)","v":""},{"$f":"IF(Lots!A261=\"\",\"\",Lots!EA261)","v":""},{"$f":"IF(Lots!A261=\"\",\"\",Lots!EB261)","v":""},{"$f":"IF(Lots!A261=\"\",\"\",Lots!EK261)","v":""},{"$f":"IF(Lots!A261=\"\",\"\",Lots!EF261)","v":""},{"$f":"IF(Lots!F261=\"\",\"\",Lots!EG261)","v":""},{"$f":"IF(Lots!H261=\"\",\"\",Lots!EH261)","v":""},"",{"$f":"IF(A272=\"\",\"\",IF(Lots!ET261=TRUE,\"D\",\"S\"))","v":""},0,0,0,{"$f":"IF(Lots!A261=\"\",\"\",Lots!EM261)","v":""},{"$f":"IF(Lots!A261=\"\",\"\",Lots!EN261)","v":""},{"$f":"IF(Lots!A261=\"\",\"\",Lots!EO261)","v":""},{"$f":"IF(Lots!A261=\"\",\"\",Lots!EP261)","v":""},{"$f":"IF(Lots!A261=\"\",\"\",Lots!EQ261)","v":""},{"$f":"IF(Lots!A261=\"\",\"\",Lots!ER261)","v":""}]
[{"$f":"IF(Lots!A262=\"\",\"\",Lots!A262)","v":""},{"$f":"IF(Lots!A262=\"\",\"\",Lots!F262)","v":""},{"$f":"IF(Lots!A262=\"\",\"\",Lots!J262)","v":""},{"$f":"IF(Lots!A262=\"\",\"\",Lots!G262)","v":""},{"$f":"IF(Lots!A262=\"\",\"\",Lots!H262)","v":""},{"$f":"IF(Lots!A262=\"\",\"\",Lots!EA262)","v":""},{"$f":"IF(Lots!A262=\"\",\"\",Lots!EB262)","v":""},{"$f":"IF(Lots!A262=\"\",\"\",Lots!EK262)","v":""},{"$f":"IF(Lots!A262=\"\",\"\",Lots!EF262)","v":""},{"$f":"IF(Lots!F262=\"\",\"\",Lots!EG262)","v":""},{"$f":"IF(Lots!H262=\"\",\"\",Lots!EH262)","v":""},"",{"$f":"IF(A273=\"\",\"\",IF(Lots!ET262=TRUE,\"D\",\"S\"))","v":""},0,0,0,{"$f":"IF(Lots!A262=\"\",\"\",Lots!EM262)","v":""},{"$f":"IF(Lots!A262=\"\",\"\",Lots!EN262)","v":""},{"$f":"IF(Lots!A262=\"\",\"\",Lots!EO262)","v":""},{"$f":"IF(Lots!A262=\"\",\"\",Lots!EP262)","v":""},{"$f":"IF(Lots!A262=\"\",\"\",Lots!EQ262)","v":""},{"$f":"IF(Lots!A262=\"\",\"\",Lots!ER262)","v":""}]
[{"$f":"IF(Lots!A263=\"\",\"\",Lots!A263)","v":""},{"$f":"IF(Lots!A263=\"\",\"\",Lots!F263)","v":""},{"$f":"IF(Lots!A263=\"\",\"\",Lots!J263)","v":""},{"$f":"IF(Lots!A263=\"\",\"\",Lots!G263)","v":""},{"$f":"IF(Lots!A263=\"\",\"\",Lots!H263)","v":""},{"$f":"IF(Lots!A263=\"\",\"\",Lots!EA263)","v":""},{"$f":"IF(Lots!A263=\"\",\"\",Lots!EB263)","v":""},{"$f":"IF(Lots!A263=\"\",\"\",Lots!EK263)","v":""},{"$f":"IF(Lots!A263=\"\",\"\",Lots!EF263)","v":""},{"$f":"IF(Lots!F263=\"\",\"\",Lots!EG263)","v":""},{"$f":"IF(Lots!H263=\"\",\"\",Lots!EH263)","v":""},"",{"$f":"IF(A274=\"\",\"\",IF(Lots!ET263=TRUE,\"D\",\"S\"))","v":""},0,0,0,{"$f":"IF(Lots!A263=\"\",\"\",Lots!EM263)","v":""},{"$f":"IF(Lots!A263=\"\",\"\",Lots!EN263)","v":""},{"$f":"IF(Lots!A263=\"\",\"\",Lots!EO263)","v":""},{"$f":"IF(Lots!A263=\"\",\"\",Lots!EP263)","v":""},{"$f":"IF(Lots!A263=\"\",\"\",Lots!EQ263)","v":""},{"$f":"IF(Lots!A263=\"\",\"\",Lots!ER263)","v":""}]
[{"$f":"IF(Lots!A264=\"\",\"\",Lots!A264)","v":""},{"$f":"IF(Lots!A264=\"\",\"\",Lots!F264)","v":""},{"$f":"IF(Lots!A264=\"\",\"\",Lots!J264)","v":""},{"$f":"IF(Lots!A264=\"\",\"\",Lots!G264)","v":""},{"$f":"IF(Lots!A264=\"\",\"\",Lots!H264)","v":""},{"$f":"IF(Lots!A264=\"\",\"\",Lots!EA264)","v":""},{"$f":"IF(Lots!A264=\"\",\"\",Lots!EB264)","v":""},{"$f":"IF(Lots!A264=\"\",\"\",Lots!EK264)","v":""},{"$f":"IF(Lots!A264=\"\",\"\",Lots!EF264)","v":""},{"$f":"IF(Lots!F264=\"\",\"\",Lots!EG264)","v":""},{"$f":"IF(Lots!H264=\"\",\"\",Lots!EH264)","v":""},"",{"$f":"IF(A275=\"\",\"\",IF(Lots!ET264=TRUE,\"D\",\"S\"))","v":""},0,0,0,{"$f":"IF(Lots!A264=\"\",\"\",Lots!EM264)","v":""},{"$f":"IF(Lots!A264=\"\",\"\",Lots!EN264)","v":""},{"$f":"IF(Lots!A264=\"\",\"\",Lots!EO264)","v":""},{"$f":"IF(Lots!A264=\"\",\"\",Lots!EP264)","v":""},{"$f":"IF(Lots!A264=\"\",\"\",Lots!EQ264)","v":""},{"$f":"IF(Lots!A264=\"\",\"\",Lots!ER264)","v":""}]
[{"$f":"IF(Lots!A265=\"\",\"\",Lots!A265)","v":""},{"$f":"IF(Lots!A265=\"\",\"\",Lots!F265)","v":""},{"$f":"IF(Lots!A265=\"\",\"\",Lots!J265)","v":""},{"$f":"IF(Lots!A265=\"\",\"\",Lots!G265)","v":""},{"$f":"IF(Lots!A265=\"\",\"\",Lots!H265)","v":""},{"$f":"IF(Lots!A265=\"\",\"\",Lots!EA265)","v":""},{"$f":"IF(Lots!A265=\"\",\"\",Lots!EB265)","v":""},{"$f":"IF(Lots!A265=\"\",\"\",Lots!EK265)","v":""},{"$f":"IF(Lots!A265=\"\",\"\",Lots!EF265)","v":""},{"$f":"IF(Lots!F265=\"\",\"\",Lots!EG265)","v":""},{"$f":"IF(Lots!H265=\"\",\"\",Lots!EH265)","v":""},"",{"$f":"IF(A276=\"\",\"\",IF(Lots!ET265=TRUE,\"D\",\"S\"))","v":""},0,0,0,{"$f":"IF(Lots!A265=\"\",\"\",Lots!EM265)","v":""},{"$f":"IF(Lots!A265=\"\",\"\",Lots!EN265)","v":""},{"$f":"IF(Lots!A265=\"\",\"\",Lots!EO265)","v":""},{"$f":"IF(Lots!A265=\"\",\"\",Lots!EP265)","v":""},{"$f":"IF(Lots!A265=\"\",\"\",Lots!EQ265)","v":""},{"$f":"IF(Lots!A265=\"\",\"\",Lots!ER265)","v":""}]
[{"$f":"IF(Lots!A266=\"\",\"\",Lots!A266)","v":""},{"$f":"IF(Lots!A266=\"\",\"\",Lots!F266)","v":""},{"$f":"IF(Lots!A266=\"\",\"\",Lots!J266)","v":""},{"$f":"IF(Lots!A266=\"\",\"\",Lots!G266)","v":""},{"$f":"IF(Lots!A266=\"\",\"\",Lots!H266)","v":""},{"$f":"IF(Lots!A266=\"\",\"\",Lots!EA266)","v":""},{"$f":"IF(Lots!A266=\"\",\"\",Lots!EB266)","v":""},{"$f":"IF(Lots!A266=\"\",\"\",Lots!EK266)","v":""},{"$f":"IF(Lots!A266=\"\",\"\",Lots!EF266)","v":""},{"$f":"IF(Lots!F266=\"\",\"\",Lots!EG266)","v":""},{"$f":"IF(Lots!H266=\"\",\"\",Lots!EH266)","v":""},"",{"$f":"IF(A277=\"\",\"\",IF(Lots!ET266=TRUE,\"D\",\"S\"))","v":""},0,0,0,{"$f":"IF(Lots!A266=\"\",\"\",Lots!EM266)","v":""},{"$f":"IF(Lots!A266=\"\",\"\",Lots!EN266)","v":""},{"$f":"IF(Lots!A266=\"\",\"\",Lots!EO266)","v":""},{"$f":"IF(Lots!A266=\"\",\"\",Lots!EP266)","v":""},{"$f":"IF(Lots!A266=\"\",\"\",Lots!EQ266)","v":""},{"$f":"IF(Lots!A266=\"\",\"\",Lots!ER266)","v":""}]
[{"$f":"IF(Lots!A267=\"\",\"\",Lots!A267)","v":""},{"$f":"IF(Lots!A267=\"\",\"\",Lots!F267)","v":""},{"$f":"IF(Lots!A267=\"\",\"\",Lots!J267)","v":""},{"$f":"IF(Lots!A267=\"\",\"\",Lots!G267)","v":""},{"$f":"IF(Lots!A267=\"\",\"\",Lots!H267)","v":""},{"$f":"IF(Lots!A267=\"\",\"\",Lots!EA267)","v":""},{"$f":"IF(Lots!A267=\"\",\"\",Lots!EB267)","v":""},{"$f":"IF(Lots!A267=\"\",\"\",Lots!EK267)","v":""},{"$f":"IF(Lots!A267=\"\",\"\",Lots!EF267)","v":""},{"$f":"IF(Lots!F267=\"\",\"\",Lots!EG267)","v":""},{"$f":"IF(Lots!H267=\"\",\"\",Lots!EH267)","v":""},"",{"$f":"IF(A278=\"\",\"\",IF(Lots!ET267=TRUE,\"D\",\"S\"))","v":""},0,0,0,{"$f":"IF(Lots!A267=\"\",\"\",Lots!EM267)","v":""},{"$f":"IF(Lots!A267=\"\",\"\",Lots!EN267)","v":""},{"$f":"IF(Lots!A267=\"\",\"\",Lots!EO267)","v":""},{"$f":"IF(Lots!A267=\"\",\"\",Lots!EP267)","v":""},{"$f":"IF(Lots!A267=\"\",\"\",Lots!EQ267)","v":""},{"$f":"IF(Lots!A267=\"\",\"\",Lots!ER267)","v":""}]
[{"$f":"IF(Lots!A268=\"\",\"\",Lots!A268)","v":""},{"$f":"IF(Lots!A268=\"\",\"\",Lots!F268)","v":""},{"$f":"IF(Lots!A268=\"\",\"\",Lots!J268)","v":""},{"$f":"IF(Lots!A268=\"\",\"\",Lots!G268)","v":""},{"$f":"IF(Lots!A268=\"\",\"\",Lots!H268)","v":""},{"$f":"IF(Lots!A268=\"\",\"\",Lots!EA268)","v":""},{"$f":"IF(Lots!A268=\"\",\"\",Lots!EB268)","v":""},{"$f":"IF(Lots!A268=\"\",\"\",Lots!EK268)","v":""},{"$f":"IF(Lots!A268=\"\",\"\",Lots!EF268)","v":""},{"$f":"IF(Lots!F268=\"\",\"\",Lots!EG268)","v":""},{"$f":"IF(Lots!H268=\"\",\"\",Lots!EH268)","v":""},"",{"$f":"IF(A279=\"\",\"\",IF(Lots!ET268=TRUE,\"D\",\"S\"))","v":""},0,0,0,{"$f":"IF(Lots!A268=\"\",\"\",Lots!EM268)","v":""},{"$f":"IF(Lots!A268=\"\",\"\",Lots!EN268)","v":""},{"$f":"IF(Lots!A268=\"\",\"\",Lots!EO268)","v":""},{"$f":"IF(Lots!A268=\"\",\"\",Lots!EP268)","v":""},{"$f":"IF(Lots!A268=\"\",\"\",Lots!EQ268)","v":""},{"$f":"IF(Lots!A268=\"\",\"\",Lots!ER268)","v":""}]
[{"$f":"IF(Lots!A269=\"\",\"\",Lots!A269)","v":""},{"$f":"IF(Lots!A269=\"\",\"\",Lots!F269)","v":""},{"$f":"IF(Lots!A269=\"\",\"\",Lots!J269)","v":""},{"$f":"IF(Lots!A269=\"\",\"\",Lots!G269)","v":""},{"$f":"IF(Lots!A269=\"\",\"\",Lots!H269)","v":""},{"$f":"IF(Lots!A269=\"\",\"\",Lots!EA269)","v":""},{"$f":"IF(Lots!A269=\"\",\"\",Lots!EB269)","v":""},{"$f":"IF(Lots!A269=\"\",\"\",Lots!EK269)","v":""},{"$f":"IF(Lots!A269=\"\",\"\",Lots!EF269)","v":""},{"$f":"IF(Lots!F269=\"\",\"\",Lots!EG269)","v":""},{"$f":"IF(Lots!H269=\"\",\"\",Lots!EH269)","v":""},"",{"$f":"IF(A280=\"\",\"\",IF(Lots!ET269=TRUE,\"D\",\"S\"))","v":""},0,0,0,{"$f":"IF(Lots!A269=\"\",\"\",Lots!EM269)","v":""},{"$f":"IF(Lots!A269=\"\",\"\",Lots!EN269)","v":""},{"$f":"IF(Lots!A269=\"\",\"\",Lots!EO269)","v":""},{"$f":"IF(Lots!A269=\"\",\"\",Lots!EP269)","v":""},{"$f":"IF(Lots!A269=\"\",\"\",Lots!EQ269)","v":""},{"$f":"IF(Lots!A269=\"\",\"\",Lots!ER269)","v":""}]
[{"$f":"IF(Lots!A270=\"\",\"\",Lots!A270)","v":""},{"$f":"IF(Lots!A270=\"\",\"\",Lots!F270)","v":""},{"$f":"IF(Lots!A270=\"\",\"\",Lots!J270)","v":""},{"$f":"IF(Lots!A270=\"\",\"\",Lots!G270)","v":""},{"$f":"IF(Lots!A270=\"\",\"\",Lots!H270)","v":""},{"$f":"IF(Lots!A270=\"\",\"\",Lots!EA270)","v":""},{"$f":"IF(Lots!A270=\"\",\"\",Lots!EB270)","v":""},{"$f":"IF(Lots!A270=\"\",\"\",Lots!EK270)","v":""},{"$f":"IF(Lots!A270=\"\",\"\",Lots!EF270)","v":""},{"$f":"IF(Lots!F270=\"\",\"\",Lots!EG270)","v":""},{"$f":"IF(Lots!H270=\"\",\"\",Lots!EH270)","v":""},"",{"$f":"IF(A281=\"\",\"\",IF(Lots!ET270=TRUE,\"D\",\"S\"))","v":""},0,0,0,{"$f":"IF(Lots!A270=\"\",\"\",Lots!EM270)","v":""},{"$f":"IF(Lots!A270=\"\",\"\",Lots!EN270)","v":""},{"$f":"IF(Lots!A270=\"\",\"\",Lots!EO270)","v":""},{"$f":"IF(Lots!A270=\"\",\"\",Lots!EP270)","v":""},{"$f":"IF(Lots!A270=\"\",\"\",Lots!EQ270)","v":""},{"$f":"IF(Lots!A270=\"\",\"\",Lots!ER270)","v":""}]
[{"$f":"IF(Lots!A271=\"\",\"\",Lots!A271)","v":""},{"$f":"IF(Lots!A271=\"\",\"\",Lots!F271)","v":""},{"$f":"IF(Lots!A271=\"\",\"\",Lots!J271)","v":""},{"$f":"IF(Lots!A271=\"\",\"\",Lots!G271)","v":""},{"$f":"IF(Lots!A271=\"\",\"\",Lots!H271)","v":""},{"$f":"IF(Lots!A271=\"\",\"\",Lots!EA271)","v":""},{"$f":"IF(Lots!A271=\"\",\"\",Lots!EB271)","v":""},{"$f":"IF(Lots!A271=\"\",\"\",Lots!EK271)","v":""},{"$f":"IF(Lots!A271=\"\",\"\",Lots!EF271)","v":""},{"$f":"IF(Lots!F271=\"\",\"\",Lots!EG271)","v":""},{"$f":"IF(Lots!H271=\"\",\"\",Lots!EH271)","v":""},{"$f":"IF(A282=\"\",\"\",SUM(J282:K282))","v":""},{"$f":"IF(A282=\"\",\"\",IF(Lots!ET271=TRUE,\"D\",\"S\"))","v":""},{"$f":"IF(A282=\"\",0,$A$8/100*D282*B282)","v":0},{"$f":"IF(A282=\"\",0,$A$8/100*E282*C282)","v":0},{"$f":"IF(I282>50,0,L282)","v":0},{"$f":"IF(Lots!A271=\"\",\"\",Lots!EM271)","v":""},{"$f":"IF(Lots!A271=\"\",\"\",Lots!EN271)","v":""},{"$f":"IF(Lots!A271=\"\",\"\",Lots!EO271)","v":""},{"$f":"IF(Lots!A271=\"\",\"\",Lots!EP271)","v":""},{"$f":"IF(Lots!A271=\"\",\"\",Lots!EQ271)","v":""},{"$f":"IF(Lots!A271=\"\",\"\",Lots!ER271)","v":""}]
[{"$f":"IF(Lots!A272=\"\",\"\",Lots!A272)","v":""},{"$f":"IF(Lots!A272=\"\",\"\",Lots!F272)","v":""},{"$f":"IF(Lots!A272=\"\",\"\",Lots!J272)","v":""},{"$f":"IF(Lots!A272=\"\",\"\",Lots!G272)","v":""},{"$f":"IF(Lots!A272=\"\",\"\",Lots!H272)","v":""},{"$f":"IF(Lots!A272=\"\",\"\",Lots!EA272)","v":""},{"$f":"IF(Lots!A272=\"\",\"\",Lots!EB272)","v":""},{"$f":"IF(Lots!A272=\"\",\"\",Lots!EK272)","v":""},{"$f":"IF(Lots!A272=\"\",\"\",Lots!EF272)","v":""},{"$f":"IF(Lots!F272=\"\",\"\",Lots!EG272)","v":""},{"$f":"IF(Lots!H272=\"\",\"\",Lots!EH272)","v":""},"",{"$f":"IF(A283=\"\",\"\",IF(Lots!ET272=TRUE,\"D\",\"S\"))","v":""},0,0,0,{"$f":"IF(Lots!A272=\"\",\"\",Lots!EM272)","v":""},{"$f":"IF(Lots!A272=\"\",\"\",Lots!EN272)","v":""},{"$f":"IF(Lots!A272=\"\",\"\",Lots!EO272)","v":""},{"$f":"IF(Lots!A272=\"\",\"\",Lots!EP272)","v":""},{"$f":"IF(Lots!A272=\"\",\"\",Lots!EQ272)","v":""},{"$f":"IF(Lots!A272=\"\",\"\",Lots!ER272)","v":""}]
[{"$f":"IF(Lots!A273=\"\",\"\",Lots!A273)","v":""},{"$f":"IF(Lots!A273=\"\",\"\",Lots!F273)","v":""},{"$f":"IF(Lots!A273=\"\",\"\",Lots!J273)","v":""},{"$f":"IF(Lots!A273=\"\",\"\",Lots!G273)","v":""},{"$f":"IF(Lots!A273=\"\",\"\",Lots!H273)","v":""},{"$f":"IF(Lots!A273=\"\",\"\",Lots!EA273)","v":""},{"$f":"IF(Lots!A273=\"\",\"\",Lots!EB273)","v":""},{"$f":"IF(Lots!A273=\"\",\"\",Lots!EK273)","v":""},{"$f":"IF(Lots!A273=\"\",\"\",Lots!EF273)","v":""},{"$f":"IF(Lots!F273=\"\",\"\",Lots!EG273)","v":""},{"$f":"IF(Lots!H273=\"\",\"\",Lots!EH273)","v":""},"",{"$f":"IF(A284=\"\",\"\",IF(Lots!ET273=TRUE,\"D\",\"S\"))","v":""},0,0,0,{"$f":"IF(Lots!A273=\"\",\"\",Lots!EM273)","v":""},{"$f":"IF(Lots!A273=\"\",\"\",Lots!EN273)","v":""},{"$f":"IF(Lots!A273=\"\",\"\",Lots!EO273)","v":""},{"$f":"IF(Lots!A273=\"\",\"\",Lots!EP273)","v":""},{"$f":"IF(Lots!A273=\"\",\"\",Lots!EQ273)","v":""},{"$f":"IF(Lots!A273=\"\",\"\",Lots!ER273)","v":""}]
[{"$f":"IF(Lots!A274=\"\",\"\",Lots!A274)","v":""},{"$f":"IF(Lots!A274=\"\",\"\",Lots!F274)","v":""},{"$f":"IF(Lots!A274=\"\",\"\",Lots!J274)","v":""},{"$f":"IF(Lots!A274=\"\",\"\",Lots!G274)","v":""},{"$f":"IF(Lots!A274=\"\",\"\",Lots!H274)","v":""},{"$f":"IF(Lots!A274=\"\",\"\",Lots!EA274)","v":""},{"$f":"IF(Lots!A274=\"\",\"\",Lots!EB274)","v":""},{"$f":"IF(Lots!A274=\"\",\"\",Lots!EK274)","v":""},{"$f":"IF(Lots!A274=\"\",\"\",Lots!EF274)","v":""},{"$f":"IF(Lots!F274=\"\",\"\",Lots!EG274)","v":""},{"$f":"IF(Lots!H274=\"\",\"\",Lots!EH274)","v":""},"",{"$f":"IF(A285=\"\",\"\",IF(Lots!ET274=TRUE,\"D\",\"S\"))","v":""},0,0,0,{"$f":"IF(Lots!A274=\"\",\"\",Lots!EM274)","v":""},{"$f":"IF(Lots!A274=\"\",\"\",Lots!EN274)","v":""},{"$f":"IF(Lots!A274=\"\",\"\",Lots!EO274)","v":""},{"$f":"IF(Lots!A274=\"\",\"\",Lots!EP274)","v":""},{"$f":"IF(Lots!A274=\"\",\"\",Lots!EQ274)","v":""},{"$f":"IF(Lots!A274=\"\",\"\",Lots!ER274)","v":""}]
[{"$f":"IF(Lots!A275=\"\",\"\",Lots!A275)","v":""},{"$f":"IF(Lots!A275=\"\",\"\",Lots!F275)","v":""},{"$f":"IF(Lots!A275=\"\",\"\",Lots!J275)","v":""},{"$f":"IF(Lots!A275=\"\",\"\",Lots!G275)","v":""},{"$f":"IF(Lots!A275=\"\",\"\",Lots!H275)","v":""},{"$f":"IF(Lots!A275=\"\",\"\",Lots!EA275)","v":""},{"$f":"IF(Lots!A275=\"\",\"\",Lots!EB275)","v":""},{"$f":"IF(Lots!A275=\"\",\"\",Lots!EK275)","v":""},{"$f":"IF(Lots!A275=\"\",\"\",Lots!EF275)","v":""},{"$f":"IF(Lots!F275=\"\",\"\",Lots!EG275)","v":""},{"$f":"IF(Lots!H275=\"\",\"\",Lots!EH275)","v":""},"",{"$f":"IF(A286=\"\",\"\",IF(Lots!ET275=TRUE,\"D\",\"S\"))","v":""},0,0,0,{"$f":"IF(Lots!A275=\"\",\"\",Lots!EM275)","v":""},{"$f":"IF(Lots!A275=\"\",\"\",Lots!EN275)","v":""},{"$f":"IF(Lots!A275=\"\",\"\",Lots!EO275)","v":""},{"$f":"IF(Lots!A275=\"\",\"\",Lots!EP275)","v":""},{"$f":"IF(Lots!A275=\"\",\"\",Lots!EQ275)","v":""},{"$f":"IF(Lots!A275=\"\",\"\",Lots!ER275)","v":""}]
[{"$f":"IF(Lots!A276=\"\",\"\",Lots!A276)","v":""},{"$f":"IF(Lots!A276=\"\",\"\",Lots!F276)","v":""},{"$f":"IF(Lots!A276=\"\",\"\",Lots!J276)","v":""},{"$f":"IF(Lots!A276=\"\",\"\",Lots!G276)","v":""},{"$f":"IF(Lots!A276=\"\",\"\",Lots!H276)","v":""},{"$f":"IF(Lots!A276=\"\",\"\",Lots!EA276)","v":""},{"$f":"IF(Lots!A276=\"\",\"\",Lots!EB276)","v":""},{"$f":"IF(Lots!A276=\"\",\"\",Lots!EK276)","v":""},{"$f":"IF(Lots!A276=\"\",\"\",Lots!EF276)","v":""},{"$f":"IF(Lots!F276=\"\",\"\",Lots!EG276)","v":""},{"$f":"IF(Lots!H276=\"\",\"\",Lots!EH276)","v":""},"",{"$f":"IF(A287=\"\",\"\",IF(Lots!ET276=TRUE,\"D\",\"S\"))","v":""},0,0,0,{"$f":"IF(Lots!A276=\"\",\"\",Lots!EM276)","v":""},{"$f":"IF(Lots!A276=\"\",\"\",Lots!EN276)","v":""},{"$f":"IF(Lots!A276=\"\",\"\",Lots!EO276)","v":""},{"$f":"IF(Lots!A276=\"\",\"\",Lots!EP276)","v":""},{"$f":"IF(Lots!A276=\"\",\"\",Lots!EQ276)","v":""},{"$f":"IF(Lots!A276=\"\",\"\",Lots!ER276)","v":""}]
[{"$f":"IF(Lots!A277=\"\",\"\",Lots!A277)","v":""},{"$f":"IF(Lots!A277=\"\",\"\",Lots!F277)","v":""},{"$f":"IF(Lots!A277=\"\",\"\",Lots!J277)","v":""},{"$f":"IF(Lots!A277=\"\",\"\",Lots!G277)","v":""},{"$f":"IF(Lots!A277=\"\",\"\",Lots!H277)","v":""},{"$f":"IF(Lots!A277=\"\",\"\",Lots!EA277)","v":""},{"$f":"IF(Lots!A277=\"\",\"\",Lots!EB277)","v":""},{"$f":"IF(Lots!A277=\"\",\"\",Lots!EK277)","v":""},{"$f":"IF(Lots!A277=\"\",\"\",Lots!EF277)","v":""},{"$f":"IF(Lots!F277=\"\",\"\",Lots!EG277)","v":""},{"$f":"IF(Lots!H277=\"\",\"\",Lots!EH277)","v":""},"",{"$f":"IF(A288=\"\",\"\",IF(Lots!ET277=TRUE,\"D\",\"S\"))","v":""},0,0,0,{"$f":"IF(Lots!A277=\"\",\"\",Lots!EM277)","v":""},{"$f":"IF(Lots!A277=\"\",\"\",Lots!EN277)","v":""},{"$f":"IF(Lots!A277=\"\",\"\",Lots!EO277)","v":""},{"$f":"IF(Lots!A277=\"\",\"\",Lots!EP277)","v":""},{"$f":"IF(Lots!A277=\"\",\"\",Lots!EQ277)","v":""},{"$f":"IF(Lots!A277=\"\",\"\",Lots!ER277)","v":""}]
[{"$f":"IF(Lots!A278=\"\",\"\",Lots!A278)","v":""},{"$f":"IF(Lots!A278=\"\",\"\",Lots!F278)","v":""},{"$f":"IF(Lots!A278=\"\",\"\",Lots!J278)","v":""},{"$f":"IF(Lots!A278=\"\",\"\",Lots!G278)","v":""},{"$f":"IF(Lots!A278=\"\",\"\",Lots!H278)","v":""},{"$f":"IF(Lots!A278=\"\",\"\",Lots!EA278)","v":""},{"$f":"IF(Lots!A278=\"\",\"\",Lots!EB278)","v":""},{"$f":"IF(Lots!A278=\"\",\"\",Lots!EK278)","v":""},{"$f":"IF(Lots!A278=\"\",\"\",Lots!EF278)","v":""},{"$f":"IF(Lots!F278=\"\",\"\",Lots!EG278)","v":""},{"$f":"IF(Lots!H278=\"\",\"\",Lots!EH278)","v":""},"",{"$f":"IF(A289=\"\",\"\",IF(Lots!ET278=TRUE,\"D\",\"S\"))","v":""},0,0,0,{"$f":"IF(Lots!A278=\"\",\"\",Lots!EM278)","v":""},{"$f":"IF(Lots!A278=\"\",\"\",Lots!EN278)","v":""},{"$f":"IF(Lots!A278=\"\",\"\",Lots!EO278)","v":""},{"$f":"IF(Lots!A278=\"\",\"\",Lots!EP278)","v":""},{"$f":"IF(Lots!A278=\"\",\"\",Lots!EQ278)","v":""},{"$f":"IF(Lots!A278=\"\",\"\",Lots!ER278)","v":""}]
[{"$f":"IF(Lots!A279=\"\",\"\",Lots!A279)","v":""},{"$f":"IF(Lots!A279=\"\",\"\",Lots!F279)","v":""},{"$f":"IF(Lots!A279=\"\",\"\",Lots!J279)","v":""},{"$f":"IF(Lots!A279=\"\",\"\",Lots!G279)","v":""},{"$f":"IF(Lots!A279=\"\",\"\",Lots!H279)","v":""},{"$f":"IF(Lots!A279=\"\",\"\",Lots!EA279)","v":""},{"$f":"IF(Lots!A279=\"\",\"\",Lots!EB279)","v":""},{"$f":"IF(Lots!A279=\"\",\"\",Lots!EK279)","v":""},{"$f":"IF(Lots!A279=\"\",\"\",Lots!EF279)","v":""},{"$f":"IF(Lots!F279=\"\",\"\",Lots!EG279)","v":""},{"$f":"IF(Lots!H279=\"\",\"\",Lots!EH279)","v":""},"",{"$f":"IF(A290=\"\",\"\",IF(Lots!ET279=TRUE,\"D\",\"S\"))","v":""},0,0,0,{"$f":"IF(Lots!A279=\"\",\"\",Lots!EM279)","v":""},{"$f":"IF(Lots!A279=\"\",\"\",Lots!EN279)","v":""},{"$f":"IF(Lots!A279=\"\",\"\",Lots!EO279)","v":""},{"$f":"IF(Lots!A279=\"\",\"\",Lots!EP279)","v":""},{"$f":"IF(Lots!A279=\"\",\"\",Lots!EQ279)","v":""},{"$f":"IF(Lots!A279=\"\",\"\",Lots!ER279)","v":""}]
[{"$f":"IF(Lots!A280=\"\",\"\",Lots!A280)","v":""},{"$f":"IF(Lots!A280=\"\",\"\",Lots!F280)","v":""},{"$f":"IF(Lots!A280=\"\",\"\",Lots!J280)","v":""},{"$f":"IF(Lots!A280=\"\",\"\",Lots!G280)","v":""},{"$f":"IF(Lots!A280=\"\",\"\",Lots!H280)","v":""},{"$f":"IF(Lots!A280=\"\",\"\",Lots!EA280)","v":""},{"$f":"IF(Lots!A280=\"\",\"\",Lots!EB280)","v":""},{"$f":"IF(Lots!A280=\"\",\"\",Lots!EK280)","v":""},{"$f":"IF(Lots!A280=\"\",\"\",Lots!EF280)","v":""},{"$f":"IF(Lots!F280=\"\",\"\",Lots!EG280)","v":""},{"$f":"IF(Lots!H280=\"\",\"\",Lots!EH280)","v":""},"",{"$f":"IF(A291=\"\",\"\",IF(Lots!ET280=TRUE,\"D\",\"S\"))","v":""},0,0,0,{"$f":"IF(Lots!A280=\"\",\"\",Lots!EM280)","v":""},{"$f":"IF(Lots!A280=\"\",\"\",Lots!EN280)","v":""},{"$f":"IF(Lots!A280=\"\",\"\",Lots!EO280)","v":""},{"$f":"IF(Lots!A280=\"\",\"\",Lots!EP280)","v":""},{"$f":"IF(Lots!A280=\"\",\"\",Lots!EQ280)","v":""},{"$f":"IF(Lots!A280=\"\",\"\",Lots!ER280)","v":""}]
[{"$f":"IF(Lots!A281=\"\",\"\",Lots!A281)","v":""},{"$f":"IF(Lots!A281=\"\",\"\",Lots!F281)","v":""},{"$f":"IF(Lots!A281=\"\",\"\",Lots!J281)","v":""},{"$f":"IF(Lots!A281=\"\",\"\",Lots!G281)","v":""},{"$f":"IF(Lots!A281=\"\",\"\",Lots!H281)","v":""},{"$f":"IF(Lots!A281=\"\",\"\",Lots!EA281)","v":""},{"$f":"IF(Lots!A281=\"\",\"\",Lots!EB281)","v":""},{"$f":"IF(Lots!A281=\"\",\"\",Lots!EK281)","v":""},{"$f":"IF(Lots!A281=\"\",\"\",Lots!EF281)","v":""},{"$f":"IF(Lots!F281=\"\",\"\",Lots!EG281)","v":""},{"$f":"IF(Lots!H281=\"\",\"\",Lots!EH281)","v":""},"",{"$f":"IF(A292=\"\",\"\",IF(Lots!ET281=TRUE,\"D\",\"S\"))","v":""},0,0,0,{"$f":"IF(Lots!A281=\"\",\"\",Lots!EM281)","v":""},{"$f":"IF(Lots!A281=\"\",\"\",Lots!EN281)","v":""},{"$f":"IF(Lots!A281=\"\",\"\",Lots!EO281)","v":""},{"$f":"IF(Lots!A281=\"\",\"\",Lots!EP281)","v":""},{"$f":"IF(Lots!A281=\"\",\"\",Lots!EQ281)","v":""},{"$f":"IF(Lots!A281=\"\",\"\",Lots!ER281)","v":""}]
[{"$f":"IF(Lots!A282=\"\",\"\",Lots!A282)","v":""},{"$f":"IF(Lots!A282=\"\",\"\",Lots!F282)","v":""},{"$f":"IF(Lots!A282=\"\",\"\",Lots!J282)","v":""},{"$f":"IF(Lots!A282=\"\",\"\",Lots!G282)","v":""},{"$f":"IF(Lots!A282=\"\",\"\",Lots!H282)","v":""},{"$f":"IF(Lots!A282=\"\",\"\",Lots!EA282)","v":""},{"$f":"IF(Lots!A282=\"\",\"\",Lots!EB282)","v":""},{"$f":"IF(Lots!A282=\"\",\"\",Lots!EK282)","v":""},{"$f":"IF(Lots!A282=\"\",\"\",Lots!EF282)","v":""},{"$f":"IF(Lots!F282=\"\",\"\",Lots!EG282)","v":""},{"$f":"IF(Lots!H282=\"\",\"\",Lots!EH282)","v":""},"",{"$f":"IF(A293=\"\",\"\",IF(Lots!ET282=TRUE,\"D\",\"S\"))","v":""},0,0,0,{"$f":"IF(Lots!A282=\"\",\"\",Lots!EM282)","v":""},{"$f":"IF(Lots!A282=\"\",\"\",Lots!EN282)","v":""},{"$f":"IF(Lots!A282=\"\",\"\",Lots!EO282)","v":""},{"$f":"IF(Lots!A282=\"\",\"\",Lots!EP282)","v":""},{"$f":"IF(Lots!A282=\"\",\"\",Lots!EQ282)","v":""},{"$f":"IF(Lots!A282=\"\",\"\",Lots!ER282)","v":""}]
[{"$f":"IF(Lots!A283=\"\",\"\",Lots!A283)","v":""},{"$f":"IF(Lots!A283=\"\",\"\",Lots!F283)","v":""},{"$f":"IF(Lots!A283=\"\",\"\",Lots!J283)","v":""},{"$f":"IF(Lots!A283=\"\",\"\",Lots!G283)","v":""},{"$f":"IF(Lots!A283=\"\",\"\",Lots!H283)","v":""},{"$f":"IF(Lots!A283=\"\",\"\",Lots!EA283)","v":""},{"$f":"IF(Lots!A283=\"\",\"\",Lots!EB283)","v":""},{"$f":"IF(Lots!A283=\"\",\"\",Lots!EK283)","v":""},{"$f":"IF(Lots!A283=\"\",\"\",Lots!EF283)","v":""},{"$f":"IF(Lots!F283=\"\",\"\",Lots!EG283)","v":""},{"$f":"IF(Lots!H283=\"\",\"\",Lots!EH283)","v":""},"",{"$f":"IF(A294=\"\",\"\",IF(Lots!ET283=TRUE,\"D\",\"S\"))","v":""},0,0,0,{"$f":"IF(Lots!A283=\"\",\"\",Lots!EM283)","v":""},{"$f":"IF(Lots!A283=\"\",\"\",Lots!EN283)","v":""},{"$f":"IF(Lots!A283=\"\",\"\",Lots!EO283)","v":""},{"$f":"IF(Lots!A283=\"\",\"\",Lots!EP283)","v":""},{"$f":"IF(Lots!A283=\"\",\"\",Lots!EQ283)","v":""},{"$f":"IF(Lots!A283=\"\",\"\",Lots!ER283)","v":""}]
[{"$f":"IF(Lots!A284=\"\",\"\",Lots!A284)","v":""},{"$f":"IF(Lots!A284=\"\",\"\",Lots!F284)","v":""},{"$f":"IF(Lots!A284=\"\",\"\",Lots!J284)","v":""},{"$f":"IF(Lots!A284=\"\",\"\",Lots!G284)","v":""},{"$f":"IF(Lots!A284=\"\",\"\",Lots!H284)","v":""},{"$f":"IF(Lots!A284=\"\",\"\",Lots!EA284)","v":""},{"$f":"IF(Lots!A284=\"\",\"\",Lots!EB284)","v":""},{"$f":"IF(Lots!A284=\"\",\"\",Lots!EK284)","v":""},{"$f":"IF(Lots!A284=\"\",\"\",Lots!EF284)","v":""},{"$f":"IF(Lots!F284=\"\",\"\",Lots!EG284)","v":""},{"$f":"IF(Lots!H284=\"\",\"\",Lots!EH284)","v":""},"",{"$f":"IF(A295=\"\",\"\",IF(Lots!ET284=TRUE,\"D\",\"S\"))","v":""},0,0,0,{"$f":"IF(Lots!A284=\"\",\"\",Lots!EM284)","v":""},{"$f":"IF(Lots!A284=\"\",\"\",Lots!EN284)","v":""},{"$f":"IF(Lots!A284=\"\",\"\",Lots!EO284)","v":""},{"$f":"IF(Lots!A284=\"\",\"\",Lots!EP284)","v":""},{"$f":"IF(Lots!A284=\"\",\"\",Lots!EQ284)","v":""},{"$f":"IF(Lots!A284=\"\",\"\",Lots!ER284)","v":""}]
[{"$f":"IF(Lots!A285=\"\",\"\",Lots!A285)","v":""},{"$f":"IF(Lots!A285=\"\",\"\",Lots!F285)","v":""},{"$f":"IF(Lots!A285=\"\",\"\",Lots!J285)","v":""},{"$f":"IF(Lots!A285=\"\",\"\",Lots!G285)","v":""},{"$f":"IF(Lots!A285=\"\",\"\",Lots!H285)","v":""},{"$f":"IF(Lots!A285=\"\",\"\",Lots!EA285)","v":""},{"$f":"IF(Lots!A285=\"\",\"\",Lots!EB285)","v":""},{"$f":"IF(Lots!A285=\"\",\"\",Lots!EK285)","v":""},{"$f":"IF(Lots!A285=\"\",\"\",Lots!EF285)","v":""},{"$f":"IF(Lots!F285=\"\",\"\",Lots!EG285)","v":""},{"$f":"IF(Lots!H285=\"\",\"\",Lots!EH285)","v":""},"",{"$f":"IF(A296=\"\",\"\",IF(Lots!ET285=TRUE,\"D\",\"S\"))","v":""},0,0,0,{"$f":"IF(Lots!A285=\"\",\"\",Lots!EM285)","v":""},{"$f":"IF(Lots!A285=\"\",\"\",Lots!EN285)","v":""},{"$f":"IF(Lots!A285=\"\",\"\",Lots!EO285)","v":""},{"$f":"IF(Lots!A285=\"\",\"\",Lots!EP285)","v":""},{"$f":"IF(Lots!A285=\"\",\"\",Lots!EQ285)","v":""},{"$f":"IF(Lots!A285=\"\",\"\",Lots!ER285)","v":""}]
[{"$f":"IF(Lots!A286=\"\",\"\",Lots!A286)","v":""},{"$f":"IF(Lots!A286=\"\",\"\",Lots!F286)","v":""},{"$f":"IF(Lots!A286=\"\",\"\",Lots!J286)","v":""},{"$f":"IF(Lots!A286=\"\",\"\",Lots!G286)","v":""},{"$f":"IF(Lots!A286=\"\",\"\",Lots!H286)","v":""},{"$f":"IF(Lots!A286=\"\",\"\",Lots!EA286)","v":""},{"$f":"IF(Lots!A286=\"\",\"\",Lots!EB286)","v":""},{"$f":"IF(Lots!A286=\"\",\"\",Lots!EK286)","v":""},{"$f":"IF(Lots!A286=\"\",\"\",Lots!EF286)","v":""},{"$f":"IF(Lots!F286=\"\",\"\",Lots!EG286)","v":""},{"$f":"IF(Lots!H286=\"\",\"\",Lots!EH286)","v":""},"",{"$f":"IF(A297=\"\",\"\",IF(Lots!ET286=TRUE,\"D\",\"S\"))","v":""},0,0,0,{"$f":"IF(Lots!A286=\"\",\"\",Lots!EM286)","v":""},{"$f":"IF(Lots!A286=\"\",\"\",Lots!EN286)","v":""},{"$f":"IF(Lots!A286=\"\",\"\",Lots!EO286)","v":""},{"$f":"IF(Lots!A286=\"\",\"\",Lots!EP286)","v":""},{"$f":"IF(Lots!A286=\"\",\"\",Lots!EQ286)","v":""},{"$f":"IF(Lots!A286=\"\",\"\",Lots!ER286)","v":""}]
[{"$f":"IF(Lots!A287=\"\",\"\",Lots!A287)","v":""},{"$f":"IF(Lots!A287=\"\",\"\",Lots!F287)","v":""},{"$f":"IF(Lots!A287=\"\",\"\",Lots!J287)","v":""},{"$f":"IF(Lots!A287=\"\",\"\",Lots!G287)","v":""},{"$f":"IF(Lots!A287=\"\",\"\",Lots!H287)","v":""},{"$f":"IF(Lots!A287=\"\",\"\",Lots!EA287)","v":""},{"$f":"IF(Lots!A287=\"\",\"\",Lots!EB287)","v":""},{"$f":"IF(Lots!A287=\"\",\"\",Lots!EK287)","v":""},{"$f":"IF(Lots!A287=\"\",\"\",Lots!EF287)","v":""},{"$f":"IF(Lots!F287=\"\",\"\",Lots!EG287)","v":""},{"$f":"IF(Lots!H287=\"\",\"\",Lots!EH287)","v":""},"",{"$f":"IF(A298=\"\",\"\",IF(Lots!ET287=TRUE,\"D\",\"S\"))","v":""},0,0,0,{"$f":"IF(Lots!A287=\"\",\"\",Lots!EM287)","v":""},{"$f":"IF(Lots!A287=\"\",\"\",Lots!EN287)","v":""},{"$f":"IF(Lots!A287=\"\",\"\",Lots!EO287)","v":""},{"$f":"IF(Lots!A287=\"\",\"\",Lots!EP287)","v":""},{"$f":"IF(Lots!A287=\"\",\"\",Lots!EQ287)","v":""},{"$f":"IF(Lots!A287=\"\",\"\",Lots!ER287)","v":""}]
[{"$f":"IF(Lots!A288=\"\",\"\",Lots!A288)","v":""},{"$f":"IF(Lots!A288=\"\",\"\",Lots!F288)","v":""},{"$f":"IF(Lots!A288=\"\",\"\",Lots!J288)","v":""},{"$f":"IF(Lots!A288=\"\",\"\",Lots!G288)","v":""},{"$f":"IF(Lots!A288=\"\",\"\",Lots!H288)","v":""},{"$f":"IF(Lots!A288=\"\",\"\",Lots!EA288)","v":""},{"$f":"IF(Lots!A288=\"\",\"\",Lots!EB288)","v":""},{"$f":"IF(Lots!A288=\"\",\"\",Lots!EK288)","v":""},{"$f":"IF(Lots!A288=\"\",\"\",Lots!EF288)","v":""},{"$f":"IF(Lots!F288=\"\",\"\",Lots!EG288)","v":""},{"$f":"IF(Lots!H288=\"\",\"\",Lots!EH288)","v":""},"",{"$f":"IF(A299=\"\",\"\",IF(Lots!ET288=TRUE,\"D\",\"S\"))","v":""},0,0,0,{"$f":"IF(Lots!A288=\"\",\"\",Lots!EM288)","v":""},{"$f":"IF(Lots!A288=\"\",\"\",Lots!EN288)","v":""},{"$f":"IF(Lots!A288=\"\",\"\",Lots!EO288)","v":""},{"$f":"IF(Lots!A288=\"\",\"\",Lots!EP288)","v":""},{"$f":"IF(Lots!A288=\"\",\"\",Lots!EQ288)","v":""},{"$f":"IF(Lots!A288=\"\",\"\",Lots!ER288)","v":""}]
[{"$f":"IF(Lots!A289=\"\",\"\",Lots!A289)","v":""},{"$f":"IF(Lots!A289=\"\",\"\",Lots!F289)","v":""},{"$f":"IF(Lots!A289=\"\",\"\",Lots!J289)","v":""},{"$f":"IF(Lots!A289=\"\",\"\",Lots!G289)","v":""},{"$f":"IF(Lots!A289=\"\",\"\",Lots!H289)","v":""},{"$f":"IF(Lots!A289=\"\",\"\",Lots!EA289)","v":""},{"$f":"IF(Lots!A289=\"\",\"\",Lots!EB289)","v":""},{"$f":"IF(Lots!A289=\"\",\"\",Lots!EK289)","v":""},{"$f":"IF(Lots!A289=\"\",\"\",Lots!EF289)","v":""},{"$f":"IF(Lots!F289=\"\",\"\",Lots!EG289)","v":""},{"$f":"IF(Lots!H289=\"\",\"\",Lots!EH289)","v":""},"",{"$f":"IF(A300=\"\",\"\",IF(Lots!ET289=TRUE,\"D\",\"S\"))","v":""},0,0,0,{"$f":"IF(Lots!A289=\"\",\"\",Lots!EM289)","v":""},{"$f":"IF(Lots!A289=\"\",\"\",Lots!EN289)","v":""},{"$f":"IF(Lots!A289=\"\",\"\",Lots!EO289)","v":""},{"$f":"IF(Lots!A289=\"\",\"\",Lots!EP289)","v":""},{"$f":"IF(Lots!A289=\"\",\"\",Lots!EQ289)","v":""},{"$f":"IF(Lots!A289=\"\",\"\",Lots!ER289)","v":""}]
[{"$f":"IF(Lots!A290=\"\",\"\",Lots!A290)","v":""},{"$f":"IF(Lots!A290=\"\",\"\",Lots!F290)","v":""},{"$f":"IF(Lots!A290=\"\",\"\",Lots!J290)","v":""},{"$f":"IF(Lots!A290=\"\",\"\",Lots!G290)","v":""},{"$f":"IF(Lots!A290=\"\",\"\",Lots!H290)","v":""},{"$f":"IF(Lots!A290=\"\",\"\",Lots!EA290)","v":""},{"$f":"IF(Lots!A290=\"\",\"\",Lots!EB290)","v":""},{"$f":"IF(Lots!A290=\"\",\"\",Lots!EK290)","v":""},{"$f":"IF(Lots!A290=\"\",\"\",Lots!EF290)","v":""},{"$f":"IF(Lots!F290=\"\",\"\",Lots!EG290)","v":""},{"$f":"IF(Lots!H290=\"\",\"\",Lots!EH290)","v":""},"",{"$f":"IF(A301=\"\",\"\",IF(Lots!ET290=TRUE,\"D\",\"S\"))","v":""},0,0,0,{"$f":"IF(Lots!A290=\"\",\"\",Lots!EM290)","v":""},{"$f":"IF(Lots!A290=\"\",\"\",Lots!EN290)","v":""},{"$f":"IF(Lots!A290=\"\",\"\",Lots!EO290)","v":""},{"$f":"IF(Lots!A290=\"\",\"\",Lots!EP290)","v":""},{"$f":"IF(Lots!A290=\"\",\"\",Lots!EQ290)","v":""},{"$f":"IF(Lots!A290=\"\",\"\",Lots!ER290)","v":""}]
[{"$f":"IF(Lots!A291=\"\",\"\",Lots!A291)","v":""},{"$f":"IF(Lots!A291=\"\",\"\",Lots!F291)","v":""},{"$f":"IF(Lots!A291=\"\",\"\",Lots!J291)","v":""},{"$f":"IF(Lots!A291=\"\",\"\",Lots!G291)","v":""},{"$f":"IF(Lots!A291=\"\",\"\",Lots!H291)","v":""},{"$f":"IF(Lots!A291=\"\",\"\",Lots!EA291)","v":""},{"$f":"IF(Lots!A291=\"\",\"\",Lots!EB291)","v":""},{"$f":"IF(Lots!A291=\"\",\"\",Lots!EK291)","v":""},{"$f":"IF(Lots!A291=\"\",\"\",Lots!EF291)","v":""},{"$f":"IF(Lots!F291=\"\",\"\",Lots!EG291)","v":""},{"$f":"IF(Lots!H291=\"\",\"\",Lots!EH291)","v":""},"",{"$f":"IF(A302=\"\",\"\",IF(Lots!ET291=TRUE,\"D\",\"S\"))","v":""},0,0,0,{"$f":"IF(Lots!A291=\"\",\"\",Lots!EM291)","v":""},{"$f":"IF(Lots!A291=\"\",\"\",Lots!EN291)","v":""},{"$f":"IF(Lots!A291=\"\",\"\",Lots!EO291)","v":""},{"$f":"IF(Lots!A291=\"\",\"\",Lots!EP291)","v":""},{"$f":"IF(Lots!A291=\"\",\"\",Lots!EQ291)","v":""},{"$f":"IF(Lots!A291=\"\",\"\",Lots!ER291)","v":""}]
[{"$f":"IF(Lots!A292=\"\",\"\",Lots!A292)","v":""},{"$f":"IF(Lots!A292=\"\",\"\",Lots!F292)","v":""},{"$f":"IF(Lots!A292=\"\",\"\",Lots!J292)","v":""},{"$f":"IF(Lots!A292=\"\",\"\",Lots!G292)","v":""},{"$f":"IF(Lots!A292=\"\",\"\",Lots!H292)","v":""},{"$f":"IF(Lots!A292=\"\",\"\",Lots!EA292)","v":""},{"$f":"IF(Lots!A292=\"\",\"\",Lots!EB292)","v":""},{"$f":"IF(Lots!A292=\"\",\"\",Lots!EK292)","v":""},{"$f":"IF(Lots!A292=\"\",\"\",Lots!EF292)","v":""},{"$f":"IF(Lots!F292=\"\",\"\",Lots!EG292)","v":""},{"$f":"IF(Lots!H292=\"\",\"\",Lots!EH292)","v":""},"",{"$f":"IF(A303=\"\",\"\",IF(Lots!ET292=TRUE,\"D\",\"S\"))","v":""},0,0,0,{"$f":"IF(Lots!A292=\"\",\"\",Lots!EM292)","v":""},{"$f":"IF(Lots!A292=\"\",\"\",Lots!EN292)","v":""},{"$f":"IF(Lots!A292=\"\",\"\",Lots!EO292)","v":""},{"$f":"IF(Lots!A292=\"\",\"\",Lots!EP292)","v":""},{"$f":"IF(Lots!A292=\"\",\"\",Lots!EQ292)","v":""},{"$f":"IF(Lots!A292=\"\",\"\",Lots!ER292)","v":""}]
[{"$f":"IF(Lots!A293=\"\",\"\",Lots!A293)","v":""},{"$f":"IF(Lots!A293=\"\",\"\",Lots!F293)","v":""},{"$f":"IF(Lots!A293=\"\",\"\",Lots!J293)","v":""},{"$f":"IF(Lots!A293=\"\",\"\",Lots!G293)","v":""},{"$f":"IF(Lots!A293=\"\",\"\",Lots!H293)","v":""},{"$f":"IF(Lots!A293=\"\",\"\",Lots!EA293)","v":""},{"$f":"IF(Lots!A293=\"\",\"\",Lots!EB293)","v":""},{"$f":"IF(Lots!A293=\"\",\"\",Lots!EK293)","v":""},{"$f":"IF(Lots!A293=\"\",\"\",Lots!EF293)","v":""},{"$f":"IF(Lots!F293=\"\",\"\",Lots!EG293)","v":""},{"$f":"IF(Lots!H293=\"\",\"\",Lots!EH293)","v":""},"",{"$f":"IF(A304=\"\",\"\",IF(Lots!ET293=TRUE,\"D\",\"S\"))","v":""},0,0,0,{"$f":"IF(Lots!A293=\"\",\"\",Lots!EM293)","v":""},{"$f":"IF(Lots!A293=\"\",\"\",Lots!EN293)","v":""},{"$f":"IF(Lots!A293=\"\",\"\",Lots!EO293)","v":""},{"$f":"IF(Lots!A293=\"\",\"\",Lots!EP293)","v":""},{"$f":"IF(Lots!A293=\"\",\"\",Lots!EQ293)","v":""},{"$f":"IF(Lots!A293=\"\",\"\",Lots!ER293)","v":""}]
[{"$f":"IF(Lots!A294=\"\",\"\",Lots!A294)","v":""},{"$f":"IF(Lots!A294=\"\",\"\",Lots!F294)","v":""},{"$f":"IF(Lots!A294=\"\",\"\",Lots!J294)","v":""},{"$f":"IF(Lots!A294=\"\",\"\",Lots!G294)","v":""},{"$f":"IF(Lots!A294=\"\",\"\",Lots!H294)","v":""},{"$f":"IF(Lots!A294=\"\",\"\",Lots!EA294)","v":""},{"$f":"IF(Lots!A294=\"\",\"\",Lots!EB294)","v":""},{"$f":"IF(Lots!A294=\"\",\"\",Lots!EK294)","v":""},{"$f":"IF(Lots!A294=\"\",\"\",Lots!EF294)","v":""},{"$f":"IF(Lots!F294=\"\",\"\",Lots!EG294)","v":""},{"$f":"IF(Lots!H294=\"\",\"\",Lots!EH294)","v":""},"",{"$f":"IF(A305=\"\",\"\",IF(Lots!ET294=TRUE,\"D\",\"S\"))","v":""},0,0,0,{"$f":"IF(Lots!A294=\"\",\"\",Lots!EM294)","v":""},{"$f":"IF(Lots!A294=\"\",\"\",Lots!EN294)","v":""},{"$f":"IF(Lots!A294=\"\",\"\",Lots!EO294)","v":""},{"$f":"IF(Lots!A294=\"\",\"\",Lots!EP294)","v":""},{"$f":"IF(Lots!A294=\"\",\"\",Lots!EQ294)","v":""},{"$f":"IF(Lots!A294=\"\",\"\",Lots!ER294)","v":""}]
[{"$f":"IF(Lots!A295=\"\",\"\",Lots!A295)","v":""},{"$f":"IF(Lots!A295=\"\",\"\",Lots!F295)","v":""},{"$f":"IF(Lots!A295=\"\",\"\",Lots!J295)","v":""},{"$f":"IF(Lots!A295=\"\",\"\",Lots!G295)","v":""},{"$f":"IF(Lots!A295=\"\",\"\",Lots!H295)","v":""},{"$f":"IF(Lots!A295=\"\",\"\",Lots!EA295)","v":""},{"$f":"IF(Lots!A295=\"\",\"\",Lots!EB295)","v":""},{"$f":"IF(Lots!A295=\"\",\"\",Lots!EK295)","v":""},{"$f":"IF(Lots!A295=\"\",\"\",Lots!EF295)","v":""},{"$f":"IF(Lots!F295=\"\",\"\",Lots!EG295)","v":""},{"$f":"IF(Lots!H295=\"\",\"\",Lots!EH295)","v":""},"",{"$f":"IF(A306=\"\",\"\",IF(Lots!ET295=TRUE,\"D\",\"S\"))","v":""},0,0,0,{"$f":"IF(Lots!A295=\"\",\"\",Lots!EM295)","v":""},{"$f":"IF(Lots!A295=\"\",\"\",Lots!EN295)","v":""},{"$f":"IF(Lots!A295=\"\",\"\",Lots!EO295)","v":""},{"$f":"IF(Lots!A295=\"\",\"\",Lots!EP295)","v":""},{"$f":"IF(Lots!A295=\"\",\"\",Lots!EQ295)","v":""},{"$f":"IF(Lots!A295=\"\",\"\",Lots!ER295)","v":""}]
[{"$f":"IF(Lots!A296=\"\",\"\",Lots!A296)","v":""},{"$f":"IF(Lots!A296=\"\",\"\",Lots!F296)","v":""},{"$f":"IF(Lots!A296=\"\",\"\",Lots!J296)","v":""},{"$f":"IF(Lots!A296=\"\",\"\",Lots!G296)","v":""},{"$f":"IF(Lots!A296=\"\",\"\",Lots!H296)","v":""},{"$f":"IF(Lots!A296=\"\",\"\",Lots!EA296)","v":""},{"$f":"IF(Lots!A296=\"\",\"\",Lots!EB296)","v":""},{"$f":"IF(Lots!A296=\"\",\"\",Lots!EK296)","v":""},{"$f":"IF(Lots!A296=\"\",\"\",Lots!EF296)","v":""},{"$f":"IF(Lots!F296=\"\",\"\",Lots!EG296)","v":""},{"$f":"IF(Lots!H296=\"\",\"\",Lots!EH296)","v":""},"",{"$f":"IF(A307=\"\",\"\",IF(Lots!ET296=TRUE,\"D\",\"S\"))","v":""},0,0,0,{"$f":"IF(Lots!A296=\"\",\"\",Lots!EM296)","v":""},{"$f":"IF(Lots!A296=\"\",\"\",Lots!EN296)","v":""},{"$f":"IF(Lots!A296=\"\",\"\",Lots!EO296)","v":""},{"$f":"IF(Lots!A296=\"\",\"\",Lots!EP296)","v":""},{"$f":"IF(Lots!A296=\"\",\"\",Lots!EQ296)","v":""},{"$f":"IF(Lots!A296=\"\",\"\",Lots!ER296)","v":""}]
[{"$f":"IF(Lots!A297=\"\",\"\",Lots!A297)","v":""},{"$f":"IF(Lots!A297=\"\",\"\",Lots!F297)","v":""},{"$f":"IF(Lots!A297=\"\",\"\",Lots!J297)","v":""},{"$f":"IF(Lots!A297=\"\",\"\",Lots!G297)","v":""},{"$f":"IF(Lots!A297=\"\",\"\",Lots!H297)","v":""},{"$f":"IF(Lots!A297=\"\",\"\",Lots!EA297)","v":""},{"$f":"IF(Lots!A297=\"\",\"\",Lots!EB297)","v":""},{"$f":"IF(Lots!A297=\"\",\"\",Lots!EK297)","v":""},{"$f":"IF(Lots!A297=\"\",\"\",Lots!EF297)","v":""},{"$f":"IF(Lots!F297=\"\",\"\",Lots!EG297)","v":""},{"$f":"IF(Lots!H297=\"\",\"\",Lots!EH297)","v":""},"",{"$f":"IF(A308=\"\",\"\",IF(Lots!ET297=TRUE,\"D\",\"S\"))","v":""},0,0,0,{"$f":"IF(Lots!A297=\"\",\"\",Lots!EM297)","v":""},{"$f":"IF(Lots!A297=\"\",\"\",Lots!EN297)","v":""},{"$f":"IF(Lots!A297=\"\",\"\",Lots!EO297)","v":""},{"$f":"IF(Lots!A297=\"\",\"\",Lots!EP297)","v":""},{"$f":"IF(Lots!A297=\"\",\"\",Lots!EQ297)","v":""},{"$f":"IF(Lots!A297=\"\",\"\",Lots!ER297)","v":""}]
[{"$f":"IF(Lots!A298=\"\",\"\",Lots!A298)","v":""},{"$f":"IF(Lots!A298=\"\",\"\",Lots!F298)","v":""},{"$f":"IF(Lots!A298=\"\",\"\",Lots!J298)","v":""},{"$f":"IF(Lots!A298=\"\",\"\",Lots!G298)","v":""},{"$f":"IF(Lots!A298=\"\",\"\",Lots!H298)","v":""},{"$f":"IF(Lots!A298=\"\",\"\",Lots!EA298)","v":""},{"$f":"IF(Lots!A298=\"\",\"\",Lots!EB298)","v":""},{"$f":"IF(Lots!A298=\"\",\"\",Lots!EK298)","v":""},{"$f":"IF(Lots!A298=\"\",\"\",Lots!EF298)","v":""},{"$f":"IF(Lots!F298=\"\",\"\",Lots!EG298)","v":""},{"$f":"IF(Lots!H298=\"\",\"\",Lots!EH298)","v":""},"",{"$f":"IF(A309=\"\",\"\",IF(Lots!ET298=TRUE,\"D\",\"S\"))","v":""},0,0,0,{"$f":"IF(Lots!A298=\"\",\"\",Lots!EM298)","v":""},{"$f":"IF(Lots!A298=\"\",\"\",Lots!EN298)","v":""},{"$f":"IF(Lots!A298=\"\",\"\",Lots!EO298)","v":""},{"$f":"IF(Lots!A298=\"\",\"\",Lots!EP298)","v":""},{"$f":"IF(Lots!A298=\"\",\"\",Lots!EQ298)","v":""},{"$f":"IF(Lots!A298=\"\",\"\",Lots!ER298)","v":""}]
[{"$f":"IF(Lots!A299=\"\",\"\",Lots!A299)","v":""},{"$f":"IF(Lots!A299=\"\",\"\",Lots!F299)","v":""},{"$f":"IF(Lots!A299=\"\",\"\",Lots!J299)","v":""},{"$f":"IF(Lots!A299=\"\",\"\",Lots!G299)","v":""},{"$f":"IF(Lots!A299=\"\",\"\",Lots!H299)","v":""},{"$f":"IF(Lots!A299=\"\",\"\",Lots!EA299)","v":""},{"$f":"IF(Lots!A299=\"\",\"\",Lots!EB299)","v":""},{"$f":"IF(Lots!A299=\"\",\"\",Lots!EK299)","v":""},{"$f":"IF(Lots!A299=\"\",\"\",Lots!EF299)","v":""},{"$f":"IF(Lots!F299=\"\",\"\",Lots!EG299)","v":""},{"$f":"IF(Lots!H299=\"\",\"\",Lots!EH299)","v":""},"",{"$f":"IF(A310=\"\",\"\",IF(Lots!ET299=TRUE,\"D\",\"S\"))","v":""},0,0,0,{"$f":"IF(Lots!A299=\"\",\"\",Lots!EM299)","v":""},{"$f":"IF(Lots!A299=\"\",\"\",Lots!EN299)","v":""},{"$f":"IF(Lots!A299=\"\",\"\",Lots!EO299)","v":""},{"$f":"IF(Lots!A299=\"\",\"\",Lots!EP299)","v":""},{"$f":"IF(Lots!A299=\"\",\"\",Lots!EQ299)","v":""},{"$f":"IF(Lots!A299=\"\",\"\",Lots!ER299)","v":""}]
[{"$f":"IF(Lots!A300=\"\",\"\",Lots!A300)","v":""},{"$f":"IF(Lots!A300=\"\",\"\",Lots!F300)","v":""},{"$f":"IF(Lots!A300=\"\",\"\",Lots!J300)","v":""},{"$f":"IF(Lots!A300=\"\",\"\",Lots!G300)","v":""},{"$f":"IF(Lots!A300=\"\",\"\",Lots!H300)","v":""},{"$f":"IF(Lots!A300=\"\",\"\",Lots!EA300)","v":""},{"$f":"IF(Lots!A300=\"\",\"\",Lots!EB300)","v":""},{"$f":"IF(Lots!A300=\"\",\"\",Lots!EK300)","v":""},{"$f":"IF(Lots!A300=\"\",\"\",Lots!EF300)","v":""},{"$f":"IF(Lots!F300=\"\",\"\",Lots!EG300)","v":""},{"$f":"IF(Lots!H300=\"\",\"\",Lots!EH300)","v":""},"",{"$f":"IF(A311=\"\",\"\",IF(Lots!ET300=TRUE,\"D\",\"S\"))","v":""},0,0,0,{"$f":"IF(Lots!A300=\"\",\"\",Lots!EM300)","v":""},{"$f":"IF(Lots!A300=\"\",\"\",Lots!EN300)","v":""},{"$f":"IF(Lots!A300=\"\",\"\",Lots!EO300)","v":""},{"$f":"IF(Lots!A300=\"\",\"\",Lots!EP300)","v":""},{"$f":"IF(Lots!A300=\"\",\"\",Lots!EQ300)","v":""},{"$f":"IF(Lots!A300=\"\",\"\",Lots!ER300)","v":""}]
[{"$f":"IF(Lots!A301=\"\",\"\",Lots!A301)","v":""},{"$f":"IF(Lots!A301=\"\",\"\",Lots!F301)","v":""},{"$f":"IF(Lots!A301=\"\",\"\",Lots!J301)","v":""},{"$f":"IF(Lots!A301=\"\",\"\",Lots!G301)","v":""},{"$f":"IF(Lots!A301=\"\",\"\",Lots!H301)","v":""},{"$f":"IF(Lots!A301=\"\",\"\",Lots!EA301)","v":""},{"$f":"IF(Lots!A301=\"\",\"\",Lots!EB301)","v":""},{"$f":"IF(Lots!A301=\"\",\"\",Lots!EK301)","v":""},{"$f":"IF(Lots!A301=\"\",\"\",Lots!EF301)","v":""},{"$f":"IF(Lots!F301=\"\",\"\",Lots!EG301)","v":""},{"$f":"IF(Lots!H301=\"\",\"\",Lots!EH301)","v":""},"",{"$f":"IF(A312=\"\",\"\",IF(Lots!ET301=TRUE,\"D\",\"S\"))","v":""},0,0,0,{"$f":"IF(Lots!A301=\"\",\"\",Lots!EM301)","v":""},{"$f":"IF(Lots!A301=\"\",\"\",Lots!EN301)","v":""},{"$f":"IF(Lots!A301=\"\",\"\",Lots!EO301)","v":""},{"$f":"IF(Lots!A301=\"\",\"\",Lots!EP301)","v":""},{"$f":"IF(Lots!A301=\"\",\"\",Lots!EQ301)","v":""},{"$f":"IF(Lots!A301=\"\",\"\",Lots!ER301)","v":""}]

{"sheet":"1","index":1,"n_rows":235,"n_cols":37,"rows_kept":235,"cut":false,"hidden":false,"merged":[]}
["P-401 ASPHALTIC CONCRETE   -  PAYMENT ADJUSTMENTS FOR DENSITIES & AIR VOIDS",null,null,null,null,null,null,null,null,null,null,null,null,null,null,null,null,null,null,null,null,null,null,null,null,null,null,"last lot plus 1 for entry box"]
[]
["AIRPORT NAME",null,null,null,null,null,null,null,null,null,null,null,null,null,null,null,null,null,null,null,null,"General Equation for test"]
["PROJECT DESCRIPTION",null,null,null,null,null,null,null,null,null,null,null,null,null,null,null,null,null,null,null,null,"N= all data not avg pts",null,"Ti = Test Criterion of suspect value"]
["PROJECT NUMBER",null,null,null,null,null,null,null,null,null,null,null,null,null,null,null,null,null,null,null,null,"n = ",{"$f":"COUNT(D36:D38,F36:F38,H36:H38,J36:J38,L36:L38,N36:N38,P36:P38,R36:R38)","v":0},"Xn = Suspect Test Value"]
[null,"DATE:",null,null,null,null,null,null,null,null,null,null,null,null,null,null,null,null,null,null,null,"stdev =",{"$f":"IF(STDEV(D36:D38,F36:F38,H36:H38,J36:J38,L36:L38,N36:N38,P36:P38,R36:R38)=0,0.00001,STDEV(D36:D38,F36:F38,H36:H38,J36:J38,L36:L38,N36:N38,P36:P38,R36:R38))","v":{"$error":"#DIV/0!"}},"X = Average of all test values"]
[null,"LOCATION:",null,null,null,null,null,null,null,null,null,null,null,null,null,null,null,null,null,null,null,"Average",{"$f":"AVERAGE(R36:R38,P36:P38,N36:N38,L36:L38,J36:J38,H36:H38,F36:F38,D36:D38)","v":{"$error":"#DIV/0!"}},"s = Standard Deviation (n-1)"]
[null,"TEST REPORT:",null,null,null,null,null,"  LOT PERCENT PAY:",null,{"$f":"IF(OR(ISTEXT(D68),OR(ISTEXT(D78),ISTEXT(D104))),\"Data?\",IF(OR(D68<55,D78<55),50,IF(AND(D69>=100,D79>=100),MAX(D69,D79),IF(AND(D69<=100,D79<=100),MIN(D69,D79),((D69*D79)/100))))-D106)","v":"Data?"},null,"% NOTE Reject material may be accepted at 50 % pay",null,null,null,null,null,null,null,null,null,"AIR VOID -TEST FOR OUTLIERS"]
[null,"       LOT NUMBER:",null,null,null,null,null,"MIX PAY TONS - $",null,{"$f":"C10*J8/100","v":{"$error":"#VALUE!"}},null,{"$f":"J9*C11","v":{"$error":"#VALUE!"}},null,null,null,null,null,null,null,null,null,"SUBLOT 1 value 1",null,"SUBLOT 2 value 1",null,"SUBLOT 3value 1",null,"SUBLOT 4 value 1",null,"SUBLOT 5 value 1",null,"SUBLOT 6 value 1",null,"SUBLOT 7 value 1",null,"SUBLOT 8 value 1"]
[null,"Lot Mix (Tons)",null,null,null,null,null,"AC PAY TONS -$",null,{"$f":"C14*J8/100","v":{"$error":"#DIV/0!"}},null,{"$f":"J10*C12","v":{"$error":"#DIV/0!"}},null,null,null,null,null,null,null,null,null,"Ti",{"$f":"ABS((D36-$W$7)/$W$6)","v":{"$error":"#DIV/0!"}},"Ti",{"$f":"ABS((F36-$W$7)/$W$6)","v":{"$error":"#DIV/0!"}},"Ti",{"$f":"ABS((H36-$W$7)/$W$6)","v":{"$error":"#DIV/0!"}},"Ti",{"$f":"ABS((J36-$W$7)/$W$6)","v":{"$error":"#DIV/0!"}},"Ti",{"$f":"ABS((L36-$W$7)/$W$6)","v":{"$error":"#DIV/0!"}},"Ti",{"$f":"ABS((N36-$W$7)/$W$6)","v":{"$error":"#DIV/0!"}},"Ti",{"$f":"ABS((P36-$W$7)/$W$6)","v":{"$error":"#DIV/0!"}},"Ti",{"$f":"ABS((R36-$W$7)/$W$6)","v":{"$error":"#DIV/0!"}}]
[null,"Mix Price per Ton:",null,null,null,null,null,null,null,null,null,null,null,null,null,null,null,null,null,null,null,"lookup 5%",{"$f":"IF(W5=2,1,VLOOKUP($W$5,$V$37:$W$49,2))","v":{"$error":"#N/A"}}]
[null,"AC Price per Ton:",null,null,null,null,null,null,null,null,null,null,null,null,null,null,null,null,null,null,null,null,{"$f":"IF(D36>0,IF(W10<$W$11,\"OK\",\"outlier\"),\"no data\")","v":"no data"},null,{"$f":"IF(F36>0,IF(Y10<$W$11,\"OK\",\"outlier\"),\"no data\")","v":"no data"},null,{"$f":"IF(H36>0,IF(AA10<$W$11,\"OK\",\"outlier\"),\"no data\")","v":"no data"},null,{"$f":"IF(J36>0,IF(AC10<$W$11,\"OK\",\"outlier\"),\"no data\")","v":"no data"},null,{"$f":"IF(L36>0,IF(AE10<$W$11,\"OK\",\"outlier\"),\"no data\")","v":"no data"},null,{"$f":"IF(N36>0,IF(AG10<$W$11,\"OK\",\"outlier\"),\"no data\")","v":"no data"},null,{"$f":"IF(P36>0,IF(AI10<$W$11,\"OK\",\"outlier\"),\"no data\")","v":"no data"},null,{"$f":"IF(R36>0,IF(AK10<$W$11,\"OK\",\"outlier\"),\"no data\")","v":"no data"}]
[null,null,null,null,null,null,null,null,null,null,null,null,null,null,null,null,null,null,null,null,null,"sublot 1 value 2",null,"sublot 2 value 2",null,"sublot 3 value 2",null,"sublot 4 value 2",null,"sublot 5 value 2",null,"sublot 6 value 2",null,"sublot 7 value 2",null,"sublot 8 value 2"]
[null,"Lot AC (Tons)",{"$f":"L17/100*C10","v":{"$error":"#DIV/0!"}},null,null,null,null,"JOINT DEN. RESULT:",null,{"$f":"D104","v":100},null,"= PWL=>",null,{"$f":"IF(J14=\"ERROR\",\"NEED DATA\",IF((AND(J14<71,J14>0)),\"Stop Production, 5% deduct will apply\",IF((AND(J14<80,J14>0)),\"STOP PRODUCTION\",IF((AND(J14<90,J14>=80)),\"CORRECTIVE ACTION NEEDED\",IF((J14>=90),\"ACCEPTABLE\",\"NEED DATA\")))))","v":"ACCEPTABLE"},null,null,null,null,null,null,null,"Ti",{"$f":"ABS((D37-$W$7)/$W$6)","v":{"$error":"#DIV/0!"}},"Ti",{"$f":"ABS((F37-$W$7)/$W$6)","v":{"$error":"#DIV/0!"}},"Ti",{"$f":"ABS((H37-$W$7)/$W$6)","v":{"$error":"#DIV/0!"}},"Ti",{"$f":"ABS((J37-$W$7)/$W$6)","v":{"$error":"#DIV/0!"}},"Ti",{"$f":"ABS((L37-$W$7)/$W$6)","v":{"$error":"#DIV/0!"}},"Ti",{"$f":"ABS((N37-$W$7)/$W$6)","v":{"$error":"#DIV/0!"}},"Ti",{"$f":"ABS((P37-$W$7)/$W$6)","v":{"$error":"#DIV/0!"}},"Ti",{"$f":"ABS((R37-$W$7)/$W$6)","v":{"$error":"#DIV/0!"}}]
[null,null,null,null,null,null,null,null,null,null,null,null,null,null,null,null,null,null,null,null,null,null,{"$f":"IF(D37>0,IF(W14<$W$11,\"OK\",\"outlier\"),\"no data\")","v":"no data"},null,{"$f":"IF(F37>0,IF(Y14<$W$11,\"OK\",\"outlier\"),\"no data\")","v":"no data"},null,{"$f":"IF(H37>0,IF(AA14<$W$11,\"OK\",\"outlier\"),\"no data\")","v":"no data"},null,{"$f":"IF(J37>0,IF(AC14<$W$11,\"OK\",\"outlier\"),\"no data\")","v":"no data"},null,{"$f":"IF(L37>0,IF(AE14<$W$11,\"OK\",\"outlier\"),\"no data\")","v":"no data"},null,{"$f":"IF(N37>0,IF(AG14<$W$11,\"OK\",\"outlier\"),\"no data\")","v":"no data"},null,{"$f":"IF(P37>0,IF(AI14<$W$11,\"OK\",\"outlier\"),\"no data\")","v":"no data"},null,{"$f":"IF(R37>0,IF(AK14<$W$11,\"OK\",\"outlier\"),\"no data\")","v":"no data"}]
["INPUT DATA IN BOXES",null,null,null,null,null,null,null,null,null,null,null,null,null,null,null,null,null,null,null,null,"sublot 1 value 3",null,"sublot 2 value 3",null,"sublot 3 value 3",null,"sublot 4 value 3",null,"sublot 5 value 3",null,"sublot 6 value 3",null,"sublot 7 value 3",null,"sublot 8 value 3"]
["AC CONTENT %",null,"SPECIMEN 1:",null,null,"SPECIMEN 5:",null,null,null,"AVERAGE:",null,{"$f":"AVERAGE(D17:D20,H17:H20)","v":{"$error":"#DIV/0!"}},null,"%",null,null,null,null,null,null,null,"Ti",{"$f":"ABS((D38-$W$7)/$W$6)","v":{"$error":"#DIV/0!"}},"Ti",{"$f":"ABS((F38-$W$7)/$W$6)","v":{"$error":"#DIV/0!"}},"Ti",{"$f":"ABS((H38-$W$7)/$W$6)","v":{"$error":"#DIV/0!"}},"Ti",{"$f":"ABS((J38-$W$7)/$W$6)","v":{"$error":"#DIV/0!"}},"Ti",{"$f":"ABS((L38-$W$7)/$W$6)","v":{"$error":"#DIV/0!"}},"Ti",{"$f":"ABS((N38-$W$7)/$W$6)","v":{"$error":"#DIV/0!"}},"Ti",{"$f":"ABS((P38-$W$7)/$W$6)","v":{"$error":"#DIV/0!"}},"Ti",{"$f":"ABS((R38-$W$7)/$W$6)","v":{"$error":"#DIV/0!"}}]
["(MIN 2 SAMPLES)",null,"SPECIMEN 2:",null,null,"SPECIMEN 6:",null,null,null,null,null,null,null,null,null,null,null,null,null,null,null,null,{"$f":"IF(D38>0,IF(W17<$W$11,\"OK\",\"outlier\"),\"no data\")","v":"no data"},null,{"$f":"IF(F38>0,IF(Y17<$W$11,\"OK\",\"outlier\"),\"no data\")","v":"no data"},null,{"$f":"IF(H38>0,IF(AA17<$W$11,\"OK\",\"outlier\"),\"no data\")","v":"no data"},null,{"$f":"IF(J38>0,IF(AC17<$W$11,\"OK\",\"outlier\"),\"no data\")","v":"no data"},null,{"$f":"IF(L38>0,IF(AE17<$W$11,\"OK\",\"outlier\"),\"no data\")","v":"no data"},null,{"$f":"IF(N38>0,IF(AG17<$W$11,\"OK\",\"outlier\"),\"no data\")","v":"no data"},null,{"$f":"IF(P38>0,IF(AI17<$W$11,\"OK\",\"outlier\"),\"no data\")","v":"no data"},null,{"$f":"IF(R38>0,IF(AK17<$W$11,\"OK\",\"outlier\"),\"no data\")","v":"no data"}]
[null,null,"SPECIMEN 3:",null,null,"SPECIMEN 7:"]
[null,null,"SPECIMEN 4:",null,null,"SPECIMEN 8:"]
[null,null,null,null,null,null,null,null,null,null,null,"-",null,"ADDITIONAL SUBLOTS",null,null,null,"-",null,null,null,"MAT CORE DENSITY - TEST FOR OUTLIERS"]
[null,null,null,"SUBLOT 1",null,"SUBLOT 2",null,"SUBLOT 3",null,"SUBLOT 4",null,"SUBLOT 5",null,"SUBLOT 6",null,"SUBLOT 7",null,"SUBLOT 8",null,null,null,"General Equation for test"]
[null,null,null,null,null,null,null,null,null,null,null,null,null,null,null,null,null,null,null,null,null,"N= all data not avg pts",null,"Ti = Test Criterion of suspect value"]
["MARSHALL",null,"SAMPLE 1",null,null,null,null,null,null,null,null,null,null,null,null,null,null,null,null,null,null,"n = ",{"$f":"COUNT(D49,F49,H49,J49,L49,N49,P49,R49)","v":0},"Xn = Suspect Test Value"]
["STABILITY",null,"SAMPLE 2",null,null,null,null,null,null,null,null,null,null,null,null,null,null,null,null,null,null,"stdev =",{"$f":"IF(STDEV(R49,P49,N49,L49,J49,H49,F49,D49)=0,0.00001,STDEV(R49,P49,N49,L49,J49,H49,F49,D49))","v":{"$error":"#DIV/0!"}},"X = Average of all test values"]
[null,null,"SAMPLE 3",null,null,null,null,null,null,null,null,null,null,null,null,null,null,null,null,null,null,"Average",{"$f":"AVERAGE(D49,F49,H49,J49,L49,N49,P49,R49)","v":{"$error":"#DIV/0!"}},"s = Standard Deviation (n-1)"]
[null,null,"AVG  STABILITY:",{"$f":"IF(AND(ISBLANK(D24),ISBLANK(D25),ISBLANK(D26)),\"\",AVERAGE(D24:D26))","v":""},null,{"$f":"IF(AND(ISBLANK(F24),ISBLANK(F25),ISBLANK(F26)),\"\",AVERAGE(F24:F26))","v":""},null,"",null,"",null,"",null,"",null,"",null,"",null,null,null,"5% lookup",{"$f":"IF($W$24=2,1,VLOOKUP($W$24,$V$37:$W$49,2))","v":{"$error":"#N/A"}}]
[null,null,null,{"$f":"IF(ISERROR(D27),\"\",D27)","v":""},null,{"$f":"IF(ISERROR(F27),\"\",F27)","v":""},null,"",null,"",null,"",null,"",null,"",null,""]
[null,null,null,null,null,null,null,null,null,null,null,null,null,null,null,null,null,null,null,null,null,"sublot 1 value 3",null,"sublot 2 value 3",null,"sublot 3 value 3",null,"sublot 4 value 3",null,"sublot 5 value 3",null,"sublot 6 value 3",null,"sublot 7 value 3",null,"sublot 8 value 3"]
["MARSHALL",null,"SAMPLE 1",null,null,null,null,null,null,null,null,null,null,null,null,null,null,null,null,null,null,"Ti",{"$f":"ABS((D49-$W$26)/$W$25)","v":{"$error":"#DIV/0!"}},"Ti",{"$f":"ABS((F49-$W$26)/$W$25)","v":{"$error":"#DIV/0!"}},"Ti",{"$f":"ABS((H49-$W$26)/$W$25)","v":{"$error":"#DIV/0!"}},"Ti",{"$f":"ABS((J49-$W$26)/$W$25)","v":{"$error":"#DIV/0!"}},"Ti",{"$f":"ABS((L49-$W$26)/$W$25)","v":{"$error":"#DIV/0!"}},"Ti",{"$f":"ABS((N49-$W$26)/$W$25)","v":{"$error":"#DIV/0!"}},"Ti",{"$f":"ABS((P49-$W$26)/$W$25)","v":{"$error":"#DIV/0!"}},"Ti",{"$f":"ABS((R49-$W$26)/$W$25)","v":{"$error":"#DIV/0!"}}]
["FLOW",null,"SAMPLE 2",null,null,null,null,null,null,null,null,null,null,null,null,null,null,null,null,null,null,null,{"$f":"IF(D49>0,IF(W30<$W$27,\"OK\",\"outlier\"),\"no data\")","v":"no data"},null,{"$f":"IF(F49>0,IF(Y30<$W$27,\"OK\",\"outlier\"),\"no data\")","v":"no data"},null,{"$f":"IF(H49>0,IF(AA30<$W$27,\"OK\",\"outlier\"),\"no data\")","v":"no data"},null,{"$f":"IF(J49>0,IF(AC30<$W$27,\"OK\",\"outlier\"),\"no data\")","v":"no data"},null,{"$f":"IF(L49>0,IF(AE30<$W$27,\"OK\",\"outlier\"),\"no data\")","v":"no data"},null,{"$f":"IF(N49>0,IF(AG30<$W$27,\"OK\",\"outlier\"),\"no data\")","v":"no data"},null,{"$f":"IF(P49>0,IF(AI30<$W$27,\"OK\",\"outlier\"),\"no data\")","v":"no data"},null,{"$f":"IF(R49>0,IF(AK30<$W$27,\"OK\",\"outlier\"),\"no data\")","v":"no data"}]
[null,null,"SAMPLE 3"]
[null,null,"AVG FLOW:",{"$f":"IF(AND(ISBLANK(D30),ISBLANK(D31),ISBLANK(D32)),\"\",AVERAGE(D30:D32))","v":""},null,{"$f":"IF(AND(ISBLANK(F30),ISBLANK(F31),ISBLANK(F32)),\"\",AVERAGE(F30:F32))","v":""},null,"",null,"",null,"",null,"",null,"",null,""]
[null,null,null,{"$f":"IF(ISERROR(D33),\"\",D33)","v":""},null,{"$f":"IF(ISERROR(F33),\"\",F33)","v":""},null,"",null,"",null,"",null,"",null,"",null,""]
[null,null,null,null,"\"ok\" indicate value is NOT and outlier at 5% significance, \"x\" indicates outlier",null,null,null,null,null,null,null,null,null,null,null,null,null,null,null,null,"Outlier SIgnificance Table"]
[null,null,"SPECIMEN 1",null,{"$f":"IF(ISBLANK(D36),\"\",IF(W12=\"OK\",\"ok\",\"x\"))","v":""},null,{"$f":"IF(ISBLANK(F36),\"\",IF(Y12=\"OK\",\"ok\",\"x\"))","v":""},null,{"$f":"IF(ISBLANK(H36),\"\",IF(AA12=\"OK\",\"ok\",\"x\"))","v":""},null,{"$f":"IF(ISBLANK(J36),\"\",IF(AC12=\"OK\",\"ok\",\"x\"))","v":""},null,{"$f":"IF(ISBLANK(L36),\"\",IF(AE12=\"OK\",\"ok\",\"x\"))","v":""},null,{"$f":"IF(ISBLANK(N36),\"\",IF(AG12=\"OK\",\"ok\",\"x\"))","v":""},null,{"$f":"IF(ISBLANK(P36),\"\",IF(AI12=\"OK\",\"ok\",\"x\"))","v":""},null,{"$f":"IF(ISBLANK(R36),\"\",IF(AK12=\"OK\",\"ok\",\"x\"))","v":""},null,null,"N","5 %"]
["AIR VOIDS %",null,"SPECIMEN 2",null,{"$f":"IF(ISBLANK(D37),\"\",IF(W15=\"OK\",\"ok\",\"x\"))","v":""},null,{"$f":"IF(ISBLANK(F37),\"\",IF(Y15=\"OK\",\"ok\",\"x\"))","v":""},null,{"$f":"IF(ISBLANK(H37),\"\",IF(AA15=\"OK\",\"ok\",\"x\"))","v":""},null,{"$f":"IF(ISBLANK(J37),\"\",IF(AC15=\"OK\",\"ok\",\"x\"))","v":""},null,{"$f":"IF(ISBLANK(L37),\"\",IF(AE15=\"OK\",\"ok\",\"x\"))","v":""},null,{"$f":"IF(ISBLANK(N37),\"\",IF(AG15=\"OK\",\"ok\",\"x\"))","v":""},null,{"$f":"IF(ISBLANK(P37),\"\",IF(AI15=\"OK\",\"ok\",\"x\"))","v":""},null,{"$f":"IF(ISBLANK(R37),\"\",IF(AK15=\"OK\",\"ok\",\"x\"))","v":""},null,null,3,1.153]
[null,null,"SPECIMEN 3",null,{"$f":"IF(ISBLANK(D38),\"\",IF(W18=\"OK\",\"ok\",\"x\"))","v":""},null,{"$f":"IF(ISBLANK(F38),\"\",IF(Y18=\"OK\",\"ok\",\"x\"))","v":""},null,{"$f":"IF(ISBLANK(H38),\"\",IF(AA18=\"OK\",\"ok\",\"x\"))","v":""},null,{"$f":"IF(ISBLANK(J38),\"\",IF(AC18=\"OK\",\"ok\",\"x\"))","v":""},null,{"$f":"IF(ISBLANK(L38),\"\",IF(AE18=\"OK\",\"ok\",\"x\"))","v":""},null,{"$f":"IF(ISBLANK(N38),\"\",IF(AG18=\"OK\",\"ok\",\"x\"))","v":""},null,{"$f":"IF(ISBLANK(P38),\"\",IF(AI18=\"OK\",\"ok\",\"x\"))","v":""},null,{"$f":"IF(ISBLANK(R38),\"\",IF(AK18=\"OK\",\"ok\",\"x\"))","v":""},null,null,4,1.4630000000000001]
[null,null,"AVG AIR VOIDS:",{"$f":"IF(AND(ISBLANK(D36),ISBLANK(D37),ISBLANK(D38)),\"\",AVERAGE(D36:D38))","v":""},null,{"$f":"IF(AND(ISBLANK(F36),ISBLANK(F37),ISBLANK(F38)),\"\",AVERAGE(F36:F38))","v":""},null,{"$f":"IF(AND(ISBLANK(H36),ISBLANK(H37),ISBLANK(H38)),\"\",AVERAGE(H36:H38))","v":""},null,{"$f":"IF(AND(ISBLANK(J36),ISBLANK(J37),ISBLANK(J38)),\"\",AVERAGE(J36:J38))","v":""},null,{"$f":"IF(AND(ISBLANK(L36),ISBLANK(L37),ISBLANK(L38)),\"\",AVERAGE(L36:L38))","v":""},null,{"$f":"IF(AND(ISBLANK(N36),ISBLANK(N37),ISBLANK(N38)),\"\",AVERAGE(N36:N38))","v":""},null,{"$f":"IF(AND(ISBLANK(P36),ISBLANK(P37),ISBLANK(P38)),\"\",AVERAGE(P36:P38))","v":""},null,{"$f":"IF(AND(ISBLANK(R36),ISBLANK(R37),ISBLANK(R38)),\"\",AVERAGE(R36:R38))","v":""},null,null,null,5,1.6719999999999999]
[null,null,null,{"$f":"IF(ISERROR(D39),\"\",D39)","v":""},null,{"$f":"IF(ISERROR(F39),\"\",F39)","v":""},null,{"$f":"IF(ISERROR(H39),\"\",H39)","v":""},null,{"$f":"IF(ISERROR(J39),\"\",J39)","v":""},null,{"$f":"IF(ISERROR(L39),\"\",L39)","v":""},null,{"$f":"IF(ISERROR(N39),\"\",N39)","v":""},null,{"$f":"IF(ISERROR(P39),\"\",P39)","v":""},null,{"$f":"IF(ISERROR(R39),\"\",R39)","v":""},null,null,null,6,1.8220000000000001]
[null,null,null,null,null,null,null,null,null,null,null,null,null,null,null,null,null,null,null,null,null,7,1.9379999999999999]
["BSG ",null,"SPECIMEN 1",null,null,null,null,null,null,null,null,null,null,null,null,null,null,null,null,null,null,8,2.032]
["ASTM D2726",null,"SPECIMEN 2",null,null,null,null,null,null,null,null,null,null,null,null,null,null,null,null,null,null,9,2.11]
["ASTM D6752",null,"SPECIMEN 3",null,null,null,null,null,null,null,null,null,null,null,null,null,null,null,null,null,null,10,2.1760000000000002]
[null,null,"AVG DENSITY (#/CF):",{"$f":"IF(OR(AND(ISBLANK(D42),ISBLANK(D43),ISBLANK(D44)),AND(ISTEXT(D42),ISTEXT(D43),ISTEXT(D44))),\"\",AVERAGE(D42:D44))","v":""},null,{"$f":"IF(OR(AND(ISBLANK(F42),ISBLANK(F43),ISBLANK(F44)),AND(ISTEXT(F42),ISTEXT(F43),ISTEXT(F44))),\"\",AVERAGE(F42:F44))","v":""},null,{"$f":"IF(OR(AND(ISBLANK(H42),ISBLANK(H43),ISBLANK(H44)),AND(ISTEXT(H42),ISTEXT(H43),ISTEXT(H44))),\"\",AVERAGE(H42:H44))","v":""},null,{"$f":"IF(OR(AND(ISBLANK(J42),ISBLANK(J43),ISBLANK(J44)),AND(ISTEXT(J42),ISTEXT(J43),ISTEXT(J44))),\"\",AVERAGE(J42:J44))","v":""},null,{"$f":"IF(OR(AND(ISBLANK(L42),ISBLANK(L43),ISBLANK(L44)),AND(ISTEXT(L42),ISTEXT(L43),ISTEXT(L44))),\"\",AVERAGE(L42:L44))","v":""},null,{"$f":"IF(OR(AND(ISBLANK(N42),ISBLANK(N43),ISBLANK(N44)),AND(ISTEXT(N42),ISTEXT(N43),ISTEXT(N44))),\"\",AVERAGE(N42:N44))","v":""},null,{"$f":"IF(OR(AND(ISBLANK(P42),ISBLANK(P43),ISBLANK(P44)),AND(ISTEXT(P42),ISTEXT(P43),ISTEXT(P44))),\"\",AVERAGE(P42:P44))","v":""},null,{"$f":"IF(OR(AND(ISBLANK(R42),ISBLANK(R43),ISBLANK(R44)),AND(ISTEXT(R42),ISTEXT(R43),ISTEXT(R44))),\"\",AVERAGE(R42:R44))","v":""},null,null,null,11,2.234]
[null,null,null,{"$f":"IF(ISERROR(D45),\"\",D45)","v":""},null,{"$f":"IF(ISERROR(F45),\"\",F45)","v":""},null,{"$f":"IF(ISERROR(H45),\"\",H45)","v":""},null,{"$f":"IF(ISERROR(J45),\"\",J45)","v":""},null,{"$f":"IF(ISERROR(L45),\"\",L45)","v":""},null,{"$f":"IF(ISERROR(N45),\"\",N45)","v":""},null,{"$f":"IF(ISERROR(P45),\"\",P45)","v":""},null,{"$f":"IF(ISERROR(R45),\"\",R45)","v":""},null,null,null,12,2.2850000000000001]
[null,null,null,null,null,null,null,null,null,null,null,null,null,null,null,null,null,null,null,null,null,13,2.331]
[null,null,null,null,"\"ok\" indicate value is NOT and outlier at 5% significance, \"x\" indicates outlier",null,null,null,null,null,null,null,null,null,null,null,null,null,null,null,null,14,2.371]
["MAT  BSG",null,null,null,{"$f":"IF(ISBLANK(D49),\"\",IF(W31=\"OK\",\"ok\",\"x\"))","v":""},null,{"$f":"IF(ISBLANK(F49),\"\",IF(Y31=\"OK\",\"ok\",\"x\"))","v":""},null,{"$f":"IF(ISBLANK(H49),\"\",IF(AA31=\"OK\",\"ok\",\"x\"))","v":""},null,{"$f":"IF(ISBLANK(J49),\"\",IF(AC31=\"OK\",\"ok\",\"x\"))","v":""},null,{"$f":"IF(ISBLANK(L49),\"\",IF(AE31=\"OK\",\"ok\",\"x\"))","v":""},null,{"$f":"IF(ISBLANK(N49),\"\",IF(AG31=\"OK\",\"ok\",\"x\"))","v":""},null,{"$f":"IF(ISBLANK(P49),\"\",IF(AI31=\"OK\",\"ok\",\"x\"))","v":""},null,{"$f":"IF(ISBLANK(R49),\"\",IF(AK31=\"OK\",\"ok\",\"x\"))","v":""},null,null,15,2.4089999999999998]
[null,null,"MAT % DENSITY / SUBLOT:",{"$f":"IF(ISBLANK(D49),\"\",D49*100/$D$52)","v":""},null,{"$f":"IF(ISBLANK(F49),\"\",F49*100/$D$52)","v":""},null,{"$f":"IF(ISBLANK(H49),\"\",H49*100/$D$52)","v":""},null,{"$f":"IF(ISBLANK(J49),\"\",J49*100/$D$52)","v":""},null,{"$f":"IF(ISBLANK(L49),\"\",L49*100/$D$52)","v":""},null,{"$f":"IF(ISBLANK(N49),\"\",N49*100/$D$52)","v":""},null,{"$f":"IF(ISBLANK(P49),\"\",P49*100/$D$52)","v":""},null,{"$f":"IF(ISBLANK(R49),\"\",R49*100/$D$52)","v":""}]
[]
[null,null,"AVG BSG/ LOT:",{"$f":"AVERAGE(D45,F45,H45,J45,L45,N45,P45,R45)","v":{"$error":"#DIV/0!"}},null,null,null,null,null,null,null,"NUM OF SAMPLES",null,{"$f":"COUNT(D46,F46,H46,J46,L46,N46,P46,R46)","v":0}]
[null,null,"   AVG. % DENS. FOR LOT:",{"$f":"100*(SUM(D49:R49)/(D52*D64))","v":{"$error":"#DIV/0!"}},null,"%"]
[]
["JOINT BSG"]
[null,null,"JOINT % DENSITY FOR SUBLOT:",{"$f":"IF(ISBLANK(D55),\"\",D55*100/$L$57)","v":""},null,{"$f":"IF(ISBLANK(F55),\"\",F55*100/$L$57)","v":""},null,{"$f":"IF(ISBLANK(H55),\"\",H55*100/$L$57)","v":""},null,{"$f":"IF(ISBLANK(J55),\"\",J55*100/$L$57)","v":""},null,{"$f":"IF(ISBLANK(L55),\"\",L55*100/$L$57)","v":""},null,{"$f":"IF(ISBLANK(N55),\"\",N55*100/$L$57)","v":""},null,{"$f":"IF(ISBLANK(P55),\"\",P55*100/$L$57)","v":""},null,{"$f":"IF(ISBLANK(R55),\"\",R55*100/$L$57)","v":""}]
[null,null,"   AVG. % DENS. FOR LOT:",{"$f":"100*(AVERAGE(D55:R55)/(L57))","v":{"$error":"#DIV/0!"}},null,"%",null,null,null,"Reference Density",null,null,null,null,null,false,"Apply Joint Req?"]
[]
[]
[null,"LOCATION:",{"$f":"IF(C7=\"enter\",\"\",C7)","v":0},null,null,null,null,null,null,null,null,null,null,"93-100",null,103,null,{"$f":"IF(L70=TRUE,IF(D68=\"error\",\"\",IF(D68>=93,103,0)),\"\")","v":""}]
[null,{"$f":"B9","v":"       LOT NUMBER:"},{"$f":"IF(C9=\"enter\",\"\",C9)","v":0},null,null,null,null,null,null,null,null,null,null,"90-93",null,"PWL + 10",null,{"$f":"IF(L70=TRUE,IF(AND(D68>=90,D68<93),D68+10,\"\"),\"\")","v":""}]
[null,null,null,null,null,null,null,null,null,null,null,null,null,"70-89",null,"0.125PWL + 88.75",null,{"$f":"IF(L70=TRUE,IF(AND(D68>=70,D68<90),0.125*D68+88.75,\"\"),\"\")","v":""}]
[null,null,"MAT DENSITY CALCS:",null,null,null,null,null,null,null,null,null,null,"40-69",null,"0.75PWL + 45",null,{"$f":"IF(L70=TRUE,IF(AND(D68>=40,D68<70),0.75*D68+45,IF(D68<40,0.5,\"\")),\"\")","v":""}]
["X=",{"$f":"AVERAGE(D50,F50,H50,J50,L50,N50,P50,R50)","v":{"$error":"#DIV/0!"}}," N:",{"$f":"COUNT(D49,F49,H49,J49,L49,N49,P49,R49)","v":0},null,null,null,null,null,null,null,"base course",null,"below 40",null,"50% or reject"]
[null,null,"  Standard Deviation (S):",{"$f":"IF(STDEV(D50,F50,H50,J50,L50,N50,P50,R50)=0,0.00001,STDEV(D50,F50,H50,J50,L50,N50,P50,R50))","v":{"$error":"#DIV/0!"}},null,null,null,null,null,null,null,false,null,"96-100",null,1.06,null,{"$f":"IF(L70=FALSE,IF(OR(D68=\"error\",D68=\"no data\",\"\",IF(D68>=96,106,0)),\"\"))","v":{"$error":"#VALUE!"}}]
[null,null,"L:",{"$f":"IF(L65=TRUE,L72,L73)","v":96.3},null,"U:",null,{"$f":"IF(L70=TRUE,L74,\"N/A\")","v":"N/A"},null,null,null,null,null,"90-95",null,"PWL+10",null,{"$f":"IF(L70=FALSE,IF(AND(D68>=90,D68<96),D68+10,\"\"),\"\")","v":""}]
["Q:",{"$f":"(B64-D66)/D65","v":{"$error":"#DIV/0!"}},"PL",{"$f":"B120","v":"no data"},null,"QU",null,{"$f":"IF(L70=TRUE,(H66-B64)/D65,\"n/a\")","v":"n/a"},null,null,null,null,null,"75-90",null,"0.5PWL + 55",null,{"$f":"IF(L70=FALSE,IF(AND(D68>=75,D68<90),0.5*D68+55,\"\"),\"\")","v":""}]
[{"$f":"IF(L71=TRUE,\"Leveling Course\",\"\")","v":""},null,"PWL:",{"$f":"IF(L70=TRUE,IF(D67=\"error\",\"error\",D67+H68-100),IF(D67=\"error\",\"error\",D67))","v":"no data"},null,"PU",null,{"$f":"C120","v":"no data"},null,null,null,null,null,"55-74",null,"1.4PWL - 12",null,{"$f":"IF(L70=FALSE,IF(AND(D68>=55,D68<75),1.4*D68-12,IF(D68<55,0.5,\"\")),\"\")","v":""}]
[null,null,"     PERCENT PAY:",{"$f":"IF(A68=\"leveling course\",100,IF(D68=\"error\",\"error\",R69))","v":{"$error":"#VALUE!"}},null,"%",null,null,null,null,null,null,null,"Below 55  50% or Reject",null,null,null,{"$f":"SUM(R60:R68)","v":{"$error":"#VALUE!"}},null,null,{"$f":"IF(L70 = TRUE,\"Double Sided Density Criteria\", \"Single Sided Density Criteria\")","v":"Single Sided Density Criteria"}]
[null,null,null,null,null,null,null,null,null,null,null,null,"True uses two sided acceptance criteria"]
[null,null,null,null,null,null,null,null,null,null,null,false,{"$f":"IF(L71=TRUE,90,0)","v":0},"<-- forces 100% pay if leveling course"]
[null,null,"VOID CALCS:",null,null,null,null,null,null,null,null,95.5,"Lower limit for Base Course",null,null,null,null,null,null,null,{"$f":"IF(L70=TRUE,\"P-401 SUMMARY (Double-Sided Density IAW 5370-10G)\",\"P-401 SUMMARY (Single-Sided Density IAW 5370-10G)\")","v":"P-401 SUMMARY (Single-Sided Density IAW 5370-10G)"}]
["X=",{"$f":"AVERAGE(D39,F39,H39,J39,L39,N39,P39,R39)","v":{"$error":"#DIV/0!"}}," N:",{"$f":"COUNT(D39,F39,H39,J39,L39,N39,P39,R39)","v":0},null,null,null,null,null,null,null,96.3,"Lower limit for surface density criteria"]
[null,null,"  Standard Deviation (S):",{"$f":"IF(STDEV(D39,F39,H39,J39,L39,N39,P39,R39)=0,0.00001,STDEV(D39,F39,H39,J39,L39,N39,P39,R39))","v":{"$error":"#DIV/0!"}},null,null,null,null,null,null,null,101.3,"Upper limit for two sided Density criteria"]
[null,null,"U:",{"$f":"L75","v":5},null,"L:",null,{"$f":"L76","v":2},null,null,null,5,"Upper limit for Air Content"]
[null,null,"QU:",{"$f":"(D75-B73)/D74","v":{"$error":"#DIV/0!"}},null,"QL:",null,{"$f":"(B73-H75)/D74","v":{"$error":"#DIV/0!"}},null,null,null,2,"Lower limit for Air Conten"]
[null,null,"PU:",{"$f":"F120","v":"no data"},null,"PL:",null,{"$f":"D120","v":"no data"},null,null,null,93.3,"Lower Limit for Joint Density"]
[null,null,"PWL:",{"$f":"IF(D77=\"error\",\"error\",D77+H77-100)","v":{"$error":"#VALUE!"}}]
[null,"     PERCENT PAY:",null,{"$f":"IF(D78=\"error\",\"error\",IF(D78>=96,106,IF(D78>=90,D78+10,IF(D78>=75,(0.5*D78+55),IF(D78>=55,(1.4*D78-12),50)))))","v":{"$error":"#VALUE!"}},null,"%"]
[]
[]
[null,null,"STABILITY CALCS:"]
["X=",{"$f":"AVERAGE(D28,F28,H28,J28,L28,N28,P28,R28)","v":{"$error":"#DIV/0!"}}," N:",{"$f":"COUNT(D28,F28,H28,J28,L28,N28,P28,R28)","v":0}]
[null,null,"  Standard Deviation (S):",{"$f":"IF(STDEV(D28,F28,H28,J28,L28,N28,P28,R28)=0,0.00001,STDEV(D28,F28,H28,J28,L28,N28,P28,R28))","v":{"$error":"#DIV/0!"}}]
[null,null,"L:",{"$f":"IF($C$13=75,1800,IF($C$13=50,1000,\"NEED INPUT IN CELL C13\"))","v":"NEED INPUT IN CELL C13"}]
[null,null,"Q:",{"$f":"(B83-D85)/D84","v":{"$error":"#DIV/0!"}}]
[null,null,"PWL:",{"$f":"H120","v":0}]
[]
[]
[null,null,"FLOW CALCS:"]
["X=",{"$f":"AVERAGE(D34,F34,H34,J34,L34,N34,P34,R34)","v":{"$error":"#DIV/0!"}}," N:",{"$f":"COUNT(D34,F34,H34,J34,L34,N34,P34,R34)","v":0}]
[null,null,"  Standard Deviation (S):",{"$f":"IF(STDEV(D34,F34,H34,J34,L34,N34,P34,R34)=0,0.00001,STDEV(D34,F34,H34,J34,L34,N34,P34,R34))","v":{"$error":"#DIV/0!"}}]
[null,null,"U:",{"$f":"IF($C$13=75,16,IF($C$13=50,20,\"NEED INPUT IN CELL C14\"))","v":"NEED INPUT IN CELL C14"},null,"L:",null,8]
[null,null,"QU:",{"$f":"(D93-B91)/D92","v":{"$error":"#VALUE!"}},null,"QL:",null,{"$f":"(B91-H93)/D92","v":{"$error":"#DIV/0!"}}]
[null,null,"PU:",{"$f":"L120","v":0},null,"PL:",null,{"$f":"J120","v":0}]
[null,null,"PWL:",{"$f":"IF(D95=\"error\",\"error\",D95+H95-100)","v":-100}]
[]
[]
[null,null,"JOINT DENSITY CALCS:"]
["X=",{"$f":"AVERAGE(D56,F56,H56,J56,L56,N56,P56,R56)","v":{"$error":"#DIV/0!"}}," N:",{"$f":"COUNT(D55,F55,H55,J55,L55,N55,P55,R55)","v":0}]
[null,null,"  Standard Deviation (S):",{"$f":"IF(STDEV(D56,F56,H56,J56,L56,N56,P56,R56)=0,0.00001,STDEV(D56,F56,H56,J56,L56,N56,P56,R56))","v":{"$error":"#DIV/0!"}}]
[null,null,"L:",{"$f":"L77","v":93.3}]
[null,null,"Q:",{"$f":"(B100-D102)/D101","v":{"$error":"#DIV/0!"}}]
[null,null,"PWL:",{"$f":"IF(P57=FALSE,100,IF(L57=\"\",\"errors\",N120))","v":100}]
[]
[null,null,"Joint Deduct value",{"$f":"IF(P57=FALSE,0,IF(L57=\"\",\"Data?\",IF(D104<71,5,0)))","v":0},null,"Deduct applied directly to pay factor"]
[]
[]
[null,"Low","High","Low",null,"High",null,null,null,"Low",null,"High"]
[null,"Density","Density","Air voids",null,"Air voids",null,"Stability",null,"Flow",null,"Flow",null,"Joint Density"]
["x",{"$f":"B64","v":{"$error":"#DIV/0!"}},{"$f":"B64","v":{"$error":"#DIV/0!"}},{"$f":"B73","v":{"$error":"#DIV/0!"}},null,{"$f":"B73","v":{"$error":"#DIV/0!"}},null,{"$f":"B83","v":{"$error":"#DIV/0!"}},null,{"$f":"B91","v":{"$error":"#DIV/0!"}},null,{"$f":"B91","v":{"$error":"#DIV/0!"}},null,{"$f":"B100","v":{"$error":"#DIV/0!"}}]
["s",{"$f":"D65","v":{"$error":"#DIV/0!"}},{"$f":"D65","v":{"$error":"#DIV/0!"}},{"$f":"D74","v":{"$error":"#DIV/0!"}},null,{"$f":"D74","v":{"$error":"#DIV/0!"}},null,{"$f":"D84","v":{"$error":"#DIV/0!"}},null,{"$f":"D92","v":{"$error":"#DIV/0!"}},null,{"$f":"D92","v":{"$error":"#DIV/0!"}},null,{"$f":"D101","v":{"$error":"#DIV/0!"}}]
["Lower Spec Limit L",{"$f":"D66","v":96.3},null,{"$f":"H75","v":2},null,null,null,{"$f":"D85","v":"NEED INPUT IN CELL C13"},null,{"$f":"H93","v":8},null,null,null,{"$f":"D102","v":93.3}]
["Upper spec limit U",null,{"$f":"H66","v":"N/A"},null,null,{"$f":"D75","v":5},null,null,null,null,null,{"$f":"D93","v":"NEED INPUT IN CELL C14"}]
["(x-L)/s or (U-x)/s",{"$f":"(B111-B113)/B112","v":{"$error":"#DIV/0!"}},{"$f":"(C114-C111)/C112","v":{"$error":"#VALUE!"}},{"$f":"(D111-D113)/D112","v":{"$error":"#DIV/0!"}},null,{"$f":"(F114-F111)/F112","v":{"$error":"#DIV/0!"}},null,{"$f":"(H111-H113)/H112","v":{"$error":"#DIV/0!"}},null,{"$f":"(J111-J113)/J112","v":{"$error":"#DIV/0!"}},null,{"$f":"(L114-L111)/L112","v":{"$error":"#VALUE!"}},null,{"$f":"(N111-N113)/N112","v":{"$error":"#DIV/0!"}}]
["n=",{"$f":"D64","v":0},{"$f":"D64","v":0},{"$f":"D73","v":0},null,{"$f":"D73","v":0},null,{"$f":"D83","v":0},null,{"$f":"D91","v":0},null,{"$f":"D91","v":0},null,{"$f":"D100","v":0}]
["N/2-1",{"$f":"B116/2-1","v":-1},{"$f":"C116/2-1","v":-1},{"$f":"D116/2-1","v":-1},null,{"$f":"F116/2-1","v":-1},null,{"$f":"H116/2-1","v":-1},null,{"$f":"J116/2-1","v":-1},null,{"$f":"L116/2-1","v":-1},null,{"$f":"N116/2-1","v":-1}]
["A-LOW",{"$f":"MAX(0,1/2-1/2*B115*(B116^0.5/(B116-1)))","v":{"$error":"#DIV/0!"}},{"$f":"MAX(0,1/2-1/2*C115*(C116^0.5/(C116-1)))","v":{"$error":"#VALUE!"}},{"$f":"MAX(0,1/2-1/2*D115*(D116^0.5/(D116-1)))","v":{"$error":"#DIV/0!"}},null,{"$f":"MAX(0,1/2-1/2*F115*(F116^0.5/(F116-1)))","v":{"$error":"#DIV/0!"}},null,{"$f":"MAX(0,1/2-1/2*H115*(H116^0.5/(H116-1)))","v":{"$error":"#DIV/0!"}},null,{"$f":"MAX(0,1/2-1/2*J115*(J116^0.5/(J116-1)))","v":{"$error":"#DIV/0!"}},null,{"$f":"MAX(0,1/2-1/2*L115*(L116^0.5/(L116-1)))","v":{"$error":"#VALUE!"}},null,{"$f":"MAX(0,1/2-1/2*N115*(N116^0.5/(N116-1)))","v":{"$error":"#DIV/0!"}}]
["BETA-L",{"$f":"IF(B118>1,1,MAX(0,ROUND(BETADIST(B118,B117,B117,0),5)))","v":{"$error":"#DIV/0!"}},{"$f":"IF(C118>1,1,MAX(0,ROUND(BETADIST(C118,C117,C117,0),5)))","v":{"$error":"#VALUE!"}},{"$f":"IF(D118>1,1,MAX(0,ROUND(BETADIST(D118,D117,D117,0),5)))","v":{"$error":"#DIV/0!"}},null,{"$f":"IF(F118>1,1,MAX(0,ROUND(BETADIST(F118,F117,F117,0),5)))","v":{"$error":"#DIV/0!"}},null,{"$f":"IF(H118>1,1,MAX(0,ROUND(BETADIST(H118,H117,H117,0),5)))","v":{"$error":"#DIV/0!"}},null,{"$f":"IF(J118>1,1,MAX(0,ROUND(BETADIST(J118,J117,J117,0),5)))","v":{"$error":"#DIV/0!"}},null,{"$f":"IF(L118>1,1,MAX(0,ROUND(BETADIST(L118,L117,L117,0),5)))","v":{"$error":"#VALUE!"}},null,{"$f":"IF(N118>1,1,MAX(0,ROUND(BETADIST(N118,N117,N117,0),5)))","v":{"$error":"#DIV/0!"}}]
["PWL",{"$f":"IF(A68=\"leveling course\",100,IF(B116=0,\"no data\",IF(ISNUMBER(B119),ROUNDUP(100*(1-B119),0),0)))","v":"no data"},{"$f":"IF(A68=\"leveling course\",100,IF(C116=0,\"no data\",IF(ISNUMBER(C119),ROUNDUP(100*(1-C119),0),0)))","v":"no data"},{"$f":"IF(D116=0,\"no data\",IF(ISNUMBER(D119),ROUNDUP(100*(1-D119),0),0))","v":"no data"},null,{"$f":"IF(F116=0,\"no data\",IF(ISNUMBER(F119),ROUNDUP(100*(1-F119),0),0))","v":"no data"},null,{"$f":"IF(ISNUMBER(H119),ROUNDUP(100*(1-H119),0),0)","v":0},null,{"$f":"IF(ISNUMBER(J119),ROUNDUP(100*(1-J119),0),0)","v":0},null,{"$f":"IF(ISNUMBER(L119),ROUNDUP(100*(1-L119),0),0)","v":0},null,{"$f":"IF(N116=0,\"no data\",IF(ISNUMBER(N119),ROUNDUP(100*(1-N119),0),0))","v":"no data"}]
[]
[]
[]
[]
[]
[]
[]
[]
[]
[]
[]
[]
[]
[]
[]
[]
[]
[]
[]
[]
[]
[]
[]
[]
[]
[]
[]
[]
[]
[]
[]
[]
[]
[]
[]
[]
[]
[]
[]
[]
[]
[]
[]
[]
[]
[]
[]
[]
[]
[]
[]
[]
[]
[]
[]
[]
[]
[]
[]
[]
[]
[]
[]
[]
[]
[]
[]
[]
[]
[]
[]
[]
[]
[]
[]
[]
[]
[]
[]
[]
[]
[]
[]
[]
[]
[]
[]
[]
[]
[]
[]
[]
[]
[]
[]
[]
[]
[]
[]
[]
[]
[]
[]
[]
[]
[]
[]
[]
[]
[]
[]
[]
[]
[]
[null,null,null,null,null,null,null,null,null,null,null,null,null,null,null,null,null,null,null,null,"-"]

{"sheet":"Lots","index":2,"n_rows":1,"n_cols":151,"rows_kept":1,"cut":false,"hidden":false,"merged":[]}
[null,"Date","Location","Test report","Lot No.","Tons mix","Mix price","AC price","Blows","Lot AC tons","AC1","AC2","AC3","AC4","AC5","AC6","AC7","AC8","stab1-1","stab1-2","stab1-3","stab2-1","stab2-2","stab2-3","stab3-1","stab3-2","stab3-3","stab4-1","stab4-2","stab4-3","stab5-1","stab5-2","stab5-3","stab6-1","stab6-2","stab6-3","stab7-1","stab7-2","stab7-3","stab8-1","stab8-2","stab8-3","flow1-1","flow1-2","flow1-3","flow2-1","flow2-2","flow2-3","flow3-1","flow3-2","flow3-3","flow4-1","flow4-2","flow4-3","flow5-1","flow5-2","flow5-3","flow6-1","flow6-2","flow6-3","flow7-1","flow7-2","flow7-3","flow8-1","flow8-2","flow8-3","air1-1","air1-2","air1-3","air2-1","air2-2","air2-3","air3-1","air3-2","air3-3","air4-1","air4-2","air4-3","air5-1","air5-2","air5-3","air6-1","air6-2","air6-3","air7-1","air7-2","air7-3","air8-1","air8-2","air8-3","dens1-1","dens1-2","dens1-3","dens2-1","dens2-2","dens2-3","dens3-1","dens3-2","dens3-3","dens4-1","dens4-2","dens4-3","dens5-1","dens5-2","dens5-3","dens6-1","dens6-2","dens6-3","dens7-1","dens7-2","dens7-3","dens8-1","dens8-2","dens8-3","corden1","corden2","corden3","corden4","corden5","corden6","corden7","corden8","jntden1","jntden2","jntden3","jntden4","jntden5","jntden6","jntden7","jntden8","Matpay","Airpay","stabPWL","FlowPWL","JntPWL","totpay","mix$","AC$",{"$f":"MAX(A:A)","v":0},"Leveling?","Joint Deduct","Joint reference Density","AVG Mat Density","Mat PWL","Avg Joint Density","Joint PWL","avg Air voids","Air PWL","Base course?","2-sided Density","apply joint?"]